当前时区为 UTC + 8 小时



发表新帖 回复这个主题  [ 16 篇帖子 ]  前往页数 1, 2  下一页
作者 内容
1 楼 
 文章标题 : drcom找不到认证模块
帖子发表于 : 2010-04-09 11:50 

注册: 2010-04-06 16:46
帖子: 5
送出感谢: 0 次
接收感谢: 0 次
是怎么回事?显示请运行 sudo drcom start 运行后的结果意思是让我看drcom-install.log来找问题
急求高手解答~


页首
 用户资料  
 
2 楼 
 文章标题 : Re: drcom找不到认证模块
帖子发表于 : 2010-04-09 12:13 

注册: 2010-04-06 16:46
帖子: 5
送出感谢: 0 次
接收感谢: 0 次
:em20 老晕了 快来高手啊


页首
 用户资料  
 
3 楼 
 文章标题 : Re: drcom找不到认证模块
帖子发表于 : 2010-04-09 13:08 
头像

注册: 2008-03-25 15:49
帖子: 25877
地址: 谁知道?
送出感谢: 8
接收感谢: 10
去drcom开源网站找找呗


页首
 用户资料  
 
4 楼 
 文章标题 : Re: drcom找不到认证模块
帖子发表于 : 2010-04-09 13:08 
头像

注册: 2008-03-25 15:49
帖子: 25877
地址: 谁知道?
送出感谢: 8
接收感谢: 10
顺便看看drcom-install.log呗


页首
 用户资料  
 
5 楼 
 文章标题 : Re: drcom找不到认证模块
帖子发表于 : 2010-04-10 5:54 

注册: 2010-03-23 12:24
帖子: 405
送出感谢: 0 次
接收感谢: 0 次
:em20 :em20


_________________
爱上ubuntu!!!!!!则特纳
intel 双核 e7200@2.53Ghz
微星板ms-7514
2g内储
硬盘320GB西数
星卡 nvidia Gefore 9600GT(512)
三星 19英寸


页首
 用户资料  
 
6 楼 
 文章标题 : Re: drcom找不到认证模块
帖子发表于 : 2010-04-10 12:39 

注册: 2010-04-06 16:46
帖子: 5
送出感谢: 0 次
接收感谢: 0 次
:em06 是啥问题啊?都别晕啊


页首
 用户资料  
 
7 楼 
 文章标题 : Re: drcom找不到认证模块
帖子发表于 : 2010-04-10 13:55 
头像

注册: 2009-04-08 20:44
帖子: 189
地址: 三维空间
送出感谢: 0 次
接收感谢: 0 次
对啊,我怎么忘了看看drcom-install.log了啊!
下午回去好好看看里面是怎么了!


_________________
如果只是遇见,不能停留,不如不遇见!


页首
 用户资料  
 
8 楼 
 文章标题 : Re: drcom找不到认证模块
帖子发表于 : 2010-04-10 16:54 
头像

注册: 2009-04-08 20:44
帖子: 189
地址: 三维空间
送出感谢: 0 次
接收感谢: 0 次
下面是我的drcom-install.log文件内容!
引用:
2010年 04月 09日 星期五 20:40:38 CST 2.6.32-19-generic
drcom init script
----------------------------------
2010年 04月 09日 星期五 20:40:38 CST 2.6.32-19-generic
mkdrcom
----------------------------------
make[1]: Entering directory `/tmp/drcom'
make[1]: Leaving directory `/tmp/drcom'
Compiling drcom kernel module
Wait for a moment...
make[1]: Entering directory `/tmp/drcom'
make -C /lib/modules/2.6.32-19-generic/build M=/tmp/drcom modules
make[2]: Entering directory `/usr/src/linux-headers-2.6.32-19-generic'
CC [M] /tmp/drcom/drcom.o
/tmp/drcom/drcom.c: In function ‘build_ack_skb’:
/tmp/drcom/drcom.c:686: error: ‘struct sk_buff’ has no member named ‘dst’
/tmp/drcom/drcom.c: In function ‘build_auth_skb’:
/tmp/drcom/drcom.c:723: error: ‘struct sk_buff’ has no member named ‘dst’
make[3]: *** [/tmp/drcom/drcom.o] Error 1
make[2]: *** [_module_/tmp/drcom] Error 2
make[2]: Leaving directory `/usr/src/linux-headers-2.6.32-19-generic'
make[1]: *** [default] Error 2
make[1]: Leaving directory `/tmp/drcom'
Compile drcom kernel module failed!
2010年 04月 09日 星期五 20:41:29 CST 2.6.32-19-generic
drcom init script
----------------------------------
2010年 04月 09日 星期五 20:41:29 CST 2.6.32-19-generic
mkdrcom
----------------------------------
Compiling drcom kernel module
Wait for a moment...
make -C /lib/modules/2.6.32-19-generic/build M=/tmp/drcom modules
make[1]: Entering directory `/usr/src/linux-headers-2.6.32-19-generic'
CC [M] /tmp/drcom/drcom.o
/tmp/drcom/drcom.c: In function ‘build_ack_skb’:
/tmp/drcom/drcom.c:686: error: ‘struct sk_buff’ has no member named ‘dst’
/tmp/drcom/drcom.c: In function ‘build_auth_skb’:
/tmp/drcom/drcom.c:723: error: ‘struct sk_buff’ has no member named ‘dst’
make[2]: *** [/tmp/drcom/drcom.o] Error 1
make[1]: *** [_module_/tmp/drcom] Error 2
make[1]: Leaving directory `/usr/src/linux-headers-2.6.32-19-generic'
make: *** [default] Error 2
Compile drcom kernel module failed!
2010年 04月 10日 星期六 09:34:43 CST 2.6.32-19-generic
drcom init script


_________________
如果只是遇见,不能停留,不如不遇见!


页首
 用户资料  
 
9 楼 
 文章标题 : Re: drcom找不到认证模块
帖子发表于 : 2010-04-10 17:05 

注册: 2008-01-09 22:41
帖子: 18311
送出感谢: 0 次
接收感谢: 6
引用:
/tmp/drcom/drcom.c: In function ‘build_ack_skb’:
/tmp/drcom/drcom.c:686: error: ‘struct sk_buff’ has no member named ‘dst’
/tmp/drcom/drcom.c: In function ‘build_auth_skb’:
/tmp/drcom/drcom.c:723: error: ‘struct sk_buff’ has no member named ‘dst’


路径对吗?


页首
 用户资料  
 
10 楼 
 文章标题 : Re: drcom找不到认证模块
帖子发表于 : 2010-04-10 17:25 
头像

注册: 2008-03-25 15:49
帖子: 25877
地址: 谁知道?
送出感谢: 8
接收感谢: 10
内核头文件包没有装 :?
代码:
sudo apt-get install linux-headers-`uname -r`


页首
 用户资料  
 
11 楼 
 文章标题 : Re: drcom找不到认证模块
帖子发表于 : 2010-04-10 18:08 

注册: 2010-04-06 16:46
帖子: 5
送出感谢: 0 次
接收感谢: 0 次
哦 试试 :em06


页首
 用户资料  
 
12 楼 
 文章标题 : Re: drcom找不到认证模块
帖子发表于 : 2010-04-10 18:14 
头像

注册: 2009-04-08 20:44
帖子: 189
地址: 三维空间
送出感谢: 0 次
接收感谢: 0 次
唉,还是不行哦...
pocoyo 写道:
内核头文件包没有装 :?
代码:
sudo apt-get install linux-headers-`uname -r`

附件:
Screenshot.png
Screenshot.png [ 57.45 KiB | 被浏览 1200 次 ]



_________________
如果只是遇见,不能停留,不如不遇见!


页首
 用户资料  
 
13 楼 
 文章标题 : Re: drcom找不到认证模块
帖子发表于 : 2010-04-10 20:53 

注册: 2009-11-19 12:53
帖子: 8
送出感谢: 0 次
接收感谢: 0 次
:em20 我和lz的問題一模一樣 找不到認證模塊
已經被這個問題困擾了好久好久
就是沒能找到解決方案


页首
 用户资料  
 
14 楼 
 文章标题 : Re: drcom找不到认证模块
帖子发表于 : 2010-04-10 23:33 

注册: 2010-04-06 16:46
帖子: 5
送出感谢: 0 次
接收感谢: 0 次
:em20 都试了,还不行啊


页首
 用户资料  
 
15 楼 
 文章标题 : Re: drcom找不到认证模块
帖子发表于 : 2010-04-11 13:01 
头像

注册: 2009-04-08 20:44
帖子: 189
地址: 三维空间
送出感谢: 0 次
接收感谢: 0 次
[已解决] Drcom for 10.04上网解决方法!

http://forum.ubuntu.org.cn/viewtopic.php?f=116&t=265230


_________________
如果只是遇见,不能停留,不如不遇见!


页首
 用户资料  
 
显示帖子 :  排序  
发表新帖 回复这个主题  [ 16 篇帖子 ]  前往页数 1, 2  下一页

当前时区为 UTC + 8 小时


在线用户

正在浏览此版面的用户:没有注册用户 和 3 位游客


不能 在这个版面发表主题
不能 在这个版面回复主题
不能 在这个版面编辑帖子
不能 在这个版面删除帖子
不能 在这个版面提交附件

前往 :  
本站点为公益性站点,用于推广开源自由软件,由 DiaHosting VPSBudgetVM VPS 提供服务。
我们认为:软件应可免费取得,软件工具在各种语言环境下皆可使用,且不会有任何功能上的差异;
人们应有定制和修改软件的自由,且方式不受限制,只要他们自认为合适。

Powered by phpBB © 2000, 2002, 2005, 2007 phpBB Group
简体中文语系由 王笑宇 翻译