我的ubuntu10.10在装drcom-pum-1.0时出错,请大虾指正

桌面秀,不同桌面、不同风格。
回复
林乐章
帖子: 1
注册时间: 2011-03-16 13:31
送出感谢: 0
接收感谢: 0

我的ubuntu10.10在装drcom-pum-1.0时出错,请大虾指正

#1

帖子 林乐章 » 2011-03-16 13:35

2011年 03月 16日 星期三 13:10:06 CST 2.6.35-22-generic
drcom init script
----------------------------------

2011年 03月 16日 星期三 13:10:06 CST 2.6.35-22-generic
mkdrcom
----------------------------------

make[1]: 正在进入目录 `/tmp/drcom'
make[1]:正在离开目录 `/tmp/drcom'
Compiling drcom kernel module
Wait for a moment...

make[1]: 正在进入目录 `/tmp/drcom'
make -C /lib/modules/2.6.35-22-generic/build M=/tmp/drcom modules

make[2]: 正在进入目录 `/usr/src/linux-headers-2.6.35-22-generic'
CC [M] /tmp/drcom/drcom.o
/tmp/drcom/drcom.c:
In function ‘build_auth_skb’:
/tmp/drcom/drcom.c:722: error: ‘struct sk_buff’ has no member named ‘dst’

make[3]: *** [/tmp/drcom/drcom.o] 错误 1

make[2]: *** [_module_/tmp/drcom] 错误 2

make[2]:正在离开目录 `/usr/src/linux-headers-2.6.35-22-generic'

make[1]: *** [default] 错误 2

make[1]:正在离开目录 `/tmp/drcom'
Compile drcom kernel module failed!


2011年 03月 16日 星期三 13:11:48 CST 2.6.35-22-generic
drcom init script
----------------------------------

2011年 03月 16日 星期三 13:11:48 CST 2.6.35-22-generic
mkdrcom
----------------------------------
Compiling drcom kernel module
Wait for a moment...
make -C /lib/modules/2.6.35-22-generic/build M=/tmp/drcom modules

make[1]: 正在进入目录 `/usr/src/linux-headers-2.6.35-22-generic'
CC [M] /tmp/drcom/drcom.o
/tmp/drcom/drcom.c: In function ‘build_auth_skb’:
/tmp/drcom/drcom.c:722: error: ‘struct sk_buff’ has no member named ‘dst’

make[2]: *** [/tmp/drcom/drcom.o] 错误 1
make[1]: *** [_module_/tmp/drcom] 错误 2
make[1]:正在离开目录 `/usr/src/linux-headers-2.6.35-22-generic'
make: *** [default] 错误 2
Compile drcom kernel module failed!
回复

回到 “屏幕抓图”