当前时区为 UTC + 8 小时



发表新帖 回复这个主题  [ 5 篇帖子 ] 
作者 内容
1 楼 
 文章标题 : fcitx编译错误,是编译器的原因吗?
帖子发表于 : 2009-08-17 2:53 

注册: 2009-08-10 20:19
帖子: 17
送出感谢: 0 次
接收感谢: 0 次
make all-recursive
make[1]: 正在进入目录 `/tmp/fcitx-3.6'
Making all in doc
make[2]: 正在进入目录 `/tmp/fcitx-3.6/doc'
make[2]: 没有什么可以做的为 `all'。
make[2]:正在离开目录 `/tmp/fcitx-3.6/doc'
Making all in xpm
make[2]: 正在进入目录 `/tmp/fcitx-3.6/xpm'
make[2]: 没有什么可以做的为 `all'。
make[2]:正在离开目录 `/tmp/fcitx-3.6/xpm'
Making all in lib
make[2]: 正在进入目录 `/tmp/fcitx-3.6/lib'
gcc -DHAVE_CONFIG_H -I. -I.. -c -O2 -fno-strength-reduce -fno-strict-aliasing -g -O2 -INONE -INONE -D_ENABLE_TRAY -INONE -Wall -MT FrameMgr.o -MD -MP -MF .deps/FrameMgr.Tpo -c -o FrameMgr.o FrameMgr.c
FrameMgr.c:29:25: 错误: X11/Xlibint.h:没有该文件或目录
在包含自 FrameMgr.c:31 的文件中:
FrameMgr.h:32:21: 错误: X11/Xmd.h:没有该文件或目录
FrameMgr.h:33:22: 错误: X11/Xlib.h:没有该文件或目录
In file included from FrameMgr.c:31:
FrameMgr.h:112: 错误: expected declaration specifiers or ‘...’ before ‘Bool’
FrameMgr.h:114: 错误: expected declaration specifiers or ‘...’ before ‘Bool’
FrameMgr.h:126: 错误: expected ‘=’, ‘,’, ‘;’, ‘asm’ or ‘__attribute__’ before ‘FrameMgrIsIterLoopEnd’
FrameMgr.c:95: 错误: expected specifier-qualifier-list before ‘Bool’
FrameMgr.c:114: 错误: expected specifier-qualifier-list before ‘Bool’
FrameMgr.c:128: 错误: expected specifier-qualifier-list before ‘Bool’
FrameMgr.c:139: 错误: expected specifier-qualifier-list before ‘Bool’
FrameMgr.c:166: 错误: expected ‘=’, ‘,’, ‘;’, ‘asm’ or ‘__attribute__’ before ‘IterIsLoopEnd’
FrameMgr.c:173: 错误: expected ‘=’, ‘,’, ‘;’, ‘asm’ or ‘__attribute__’ before ‘ChainIterGetNext’
FrameMgr.c:177: 错误: expected ‘=’, ‘,’, ‘;’, ‘asm’ or ‘__attribute__’ before ‘FrameInstIsIterLoopEnd’
FrameMgr.c:182: 错误: expected ‘=’, ‘,’, ‘;’, ‘asm’ or ‘__attribute__’ before ‘_FrameMgrIsIterLoopEnd’
FrameMgr.c:183: 错误: expected ‘=’, ‘,’, ‘;’, ‘asm’ or ‘__attribute__’ before ‘_FrameMgrProcessPadding’
FrameMgr.c:216: 错误: expected declaration specifiers or ‘...’ before ‘Bool’
FrameMgr.c: 在函数‘FrameMgrInit’中:
FrameMgr.c:220: 警告: 隐式声明函数‘Xmalloc’
FrameMgr.c:226: 错误: ‘struct _FrameMgr’没有名为‘byte_swap’的成员
FrameMgr.c:226: 错误: ‘byte_swap’未声明(在此函数内第一次使用)
FrameMgr.c:226: 错误: (即使在一个函数内多次出现,每个未声明的标识符在其
FrameMgr.c:226: 错误: 所在的函数内也只报告一次。)
FrameMgr.c:227: 错误: ‘struct _FrameMgr’没有名为‘total_size’的成员
FrameMgr.c:228: 错误: ‘struct _FrameMgr’没有名为‘iters’的成员
FrameMgr.c: 在文件层:
FrameMgr.c:236: 错误: expected declaration specifiers or ‘...’ before ‘Bool’
FrameMgr.c: 在函数‘FrameMgrInitWithData’中:
FrameMgr.c:242: 错误: ‘struct _FrameMgr’没有名为‘byte_swap’的成员
FrameMgr.c:242: 错误: ‘byte_swap’未声明(在此函数内第一次使用)
FrameMgr.c:243: 错误: ‘struct _FrameMgr’没有名为‘total_size’的成员
FrameMgr.c: 在函数‘FrameMgrFree’中:
FrameMgr.c:249: 警告: 隐式声明函数‘Xfree’
FrameMgr.c: 在函数‘_FrameMgrPutToken’中:
FrameMgr.c:265: 错误: ‘struct _FrameMgr’没有名为‘total_size’的成员
FrameMgr.c:265: 错误: ‘struct _FrameMgr’没有名为‘total_size’的成员
FrameMgr.c:275: 错误: ‘struct <anonymous>’没有名为‘is_byte_len’的成员
FrameMgr.c:286: 错误: ‘struct _Iter’没有名为‘allow_expansion’的成员
FrameMgr.c:297: 错误: ‘CARD8’未声明(在此函数内第一次使用)
FrameMgr.c:297: 错误: expected expression before ‘)’ token
FrameMgr.c:302: 错误: ‘CARD16’未声明(在此函数内第一次使用)
FrameMgr.c:302: 错误: expected expression before ‘)’ token
FrameMgr.c:302: 错误: ‘struct _FrameMgr’没有名为‘byte_swap’的成员
FrameMgr.c:307: 错误: ‘CARD32’未声明(在此函数内第一次使用)
FrameMgr.c:307: 错误: expected expression before ‘)’ token
FrameMgr.c:307: 错误: ‘struct _FrameMgr’没有名为‘byte_swap’的成员
FrameMgr.c:332: 错误: expected expression before ‘)’ token
FrameMgr.c:337: 错误: expected expression before ‘)’ token
FrameMgr.c:342: 错误: expected expression before ‘)’ token
FrameMgr.c:347: 错误: expected expression before ‘)’ token
FrameMgr.c:361: 错误: expected expression before ‘)’ token
FrameMgr.c:361: 错误: ‘struct _FrameMgr’没有名为‘byte_swap’的成员
FrameMgr.c:366: 错误: expected expression before ‘)’ token
FrameMgr.c:366: 错误: ‘struct _FrameMgr’没有名为‘byte_swap’的成员
FrameMgr.c:371: 错误: expected expression before ‘)’ token
FrameMgr.c:371: 错误: ‘struct _FrameMgr’没有名为‘byte_swap’的成员
FrameMgr.c:376: 错误: expected expression before ‘)’ token
FrameMgr.c:376: 错误: ‘struct _FrameMgr’没有名为‘byte_swap’的成员
FrameMgr.c:390: 错误: expected expression before ‘)’ token
FrameMgr.c:390: 错误: ‘struct _FrameMgr’没有名为‘byte_swap’的成员
FrameMgr.c:395: 错误: expected expression before ‘)’ token
FrameMgr.c:395: 错误: ‘struct _FrameMgr’没有名为‘byte_swap’的成员
FrameMgr.c:400: 错误: expected expression before ‘)’ token
FrameMgr.c:400: 错误: ‘struct _FrameMgr’没有名为‘byte_swap’的成员
FrameMgr.c:405: 错误: expected expression before ‘)’ token
FrameMgr.c:405: 错误: ‘struct _FrameMgr’没有名为‘byte_swap’的成员
FrameMgr.c:452: 警告: 隐式声明函数‘bcopy’
FrameMgr.c:452: 警告: 隐式声明与内建函数‘bcopy’不兼容
FrameMgr.c: 在函数‘_FrameMgrGetToken’中:
FrameMgr.c:483: 错误: ‘struct _FrameMgr’没有名为‘total_size’的成员
FrameMgr.c:483: 错误: ‘struct _FrameMgr’没有名为‘total_size’的成员
FrameMgr.c:498: 错误: ‘CARD8’未声明(在此函数内第一次使用)
FrameMgr.c:498: 错误: expected expression before ‘)’ token
FrameMgr.c:502: 错误: ‘struct _FrameMgr’没有名为‘byte_swap’的成员
FrameMgr.c:502: 错误: ‘CARD16’未声明(在此函数内第一次使用)
FrameMgr.c:502: 错误: expected expression before ‘)’ token
FrameMgr.c:502: 错误: expected expression before ‘)’ token
FrameMgr.c:502: 错误: expected expression before ‘)’ token
FrameMgr.c:506: 错误: ‘struct _FrameMgr’没有名为‘byte_swap’的成员
FrameMgr.c:506: 错误: ‘CARD32’未声明(在此函数内第一次使用)
FrameMgr.c:506: 错误: expected expression before ‘)’ token
FrameMgr.c:506: 错误: expected expression before ‘)’ token
FrameMgr.c:506: 错误: expected expression before ‘)’ token
FrameMgr.c:506: 错误: expected expression before ‘)’ token
FrameMgr.c:506: 错误: expected expression before ‘)’ token
FrameMgr.c:521: 错误: ‘struct _Iter’没有名为‘start_counter’的成员
FrameMgr.c:521: 错误: ‘True’未声明(在此函数内第一次使用)
FrameMgr.c:536: 错误: expected expression before ‘)’ token
FrameMgr.c:540: 错误: expected expression before ‘)’ token
FrameMgr.c:544: 错误: expected expression before ‘)’ token
FrameMgr.c:548: 错误: expected expression before ‘)’ token
FrameMgr.c:556: 错误: ‘struct _FrameMgr’没有名为‘iters’的成员
FrameMgr.c:565: 错误: ‘struct _FrameMgr’没有名为‘byte_swap’的成员
FrameMgr.c:565: 错误: expected expression before ‘)’ token
FrameMgr.c:565: 错误: expected expression before ‘)’ token
FrameMgr.c:565: 错误: expected expression before ‘)’ token
FrameMgr.c:570: 错误: ‘struct _FrameMgr’没有名为‘byte_swap’的成员
FrameMgr.c:570: 错误: expected expression before ‘)’ token
FrameMgr.c:570: 错误: expected expression before ‘)’ token
FrameMgr.c:570: 错误: expected expression before ‘)’ token
FrameMgr.c:575: 错误: ‘struct _FrameMgr’没有名为‘byte_swap’的成员
FrameMgr.c:575: 错误: expected expression before ‘)’ token
FrameMgr.c:575: 错误: expected expression before ‘)’ token
FrameMgr.c:575: 错误: expected expression before ‘)’ token
FrameMgr.c:580: 错误: ‘struct _FrameMgr’没有名为‘byte_swap’的成员
FrameMgr.c:580: 错误: expected expression before ‘)’ token
FrameMgr.c:580: 错误: expected expression before ‘)’ token
FrameMgr.c:580: 错误: expected expression before ‘)’ token
FrameMgr.c:588: 错误: ‘struct _FrameMgr’没有名为‘iters’的成员
FrameMgr.c:597: 错误: ‘struct _FrameMgr’没有名为‘byte_swap’的成员
FrameMgr.c:597: 错误: expected expression before ‘)’ token
FrameMgr.c:597: 错误: expected expression before ‘)’ token
FrameMgr.c:597: 错误: expected expression before ‘)’ token
FrameMgr.c:597: 错误: expected expression before ‘)’ token
FrameMgr.c:597: 错误: expected expression before ‘)’ token
FrameMgr.c:602: 错误: ‘struct _FrameMgr’没有名为‘byte_swap’的成员
FrameMgr.c:602: 错误: expected expression before ‘)’ token
FrameMgr.c:602: 错误: expected expression before ‘)’ token
FrameMgr.c:602: 错误: expected expression before ‘)’ token
FrameMgr.c:602: 错误: expected expression before ‘)’ token
FrameMgr.c:602: 错误: expected expression before ‘)’ token
FrameMgr.c:607: 错误: ‘struct _FrameMgr’没有名为‘byte_swap’的成员
FrameMgr.c:607: 错误: expected expression before ‘)’ token
FrameMgr.c:607: 错误: expected expression before ‘)’ token
FrameMgr.c:607: 错误: expected expression before ‘)’ token
FrameMgr.c:607: 错误: expected expression before ‘)’ token
FrameMgr.c:607: 错误: expected expression before ‘)’ token
FrameMgr.c:612: 错误: ‘struct _FrameMgr’没有名为‘byte_swap’的成员
FrameMgr.c:612: 错误: expected expression before ‘)’ token
FrameMgr.c:612: 错误: expected expression before ‘)’ token
FrameMgr.c:612: 错误: expected expression before ‘)’ token
FrameMgr.c:612: 错误: expected expression before ‘)’ token
FrameMgr.c:612: 错误: expected expression before ‘)’ token
FrameMgr.c:620: 错误: ‘struct _FrameMgr’没有名为‘iters’的成员
FrameMgr.c:668: 错误: ‘struct _FrameMgr’没有名为‘iters’的成员
FrameMgr.c:684: 错误: ‘struct _FrameMgr’没有名为‘iters’的成员
FrameMgr.c: 在函数‘FrameMgrSetTotalSize’中:
FrameMgr.c:719: 错误: ‘struct _FrameMgr’没有名为‘total_size’的成员
FrameMgr.c: 在函数‘FrameMgrSkipToken’中:
FrameMgr.c:745: 错误: ‘struct _FrameMgr’没有名为‘total_size’的成员
FrameMgr.c:745: 错误: ‘struct _FrameMgr’没有名为‘total_size’的成员
FrameMgr.c: 在文件层:
FrameMgr.c:805: 错误: expected ‘=’, ‘,’, ‘;’, ‘asm’ or ‘__attribute__’ before ‘FrameMgrIsIterLoopEnd’
FrameMgr.c:821: 错误: expected ‘=’, ‘,’, ‘;’, ‘asm’ or ‘__attribute__’ before ‘_FrameMgrIsIterLoopEnd’
FrameMgr.c:826: 错误: expected ‘=’, ‘,’, ‘;’, ‘asm’ or ‘__attribute__’ before ‘_FrameMgrProcessPadding’
FrameMgr.c: 在函数‘FrameInstFree’中:
FrameMgr.c:873: 警告: 隐式声明函数‘ChainIterGetNext’
FrameMgr.c: 在函数‘FrameInstGetNextType’中:
FrameMgr.c:921: 错误: ‘struct <anonymous>’没有名为‘is_byte_len’的成员
FrameMgr.c: 在函数‘FrameInstPeekNextType’中:
FrameMgr.c:1072: 错误: ‘struct <anonymous>’没有名为‘is_byte_len’的成员
FrameMgr.c: 在文件层:
FrameMgr.c:1185: 错误: expected ‘=’, ‘,’, ‘;’, ‘asm’ or ‘__attribute__’ before ‘FrameInstIsIterLoopEnd’
FrameMgr.c: 在函数‘_FrameMgrAppendIter’中:
FrameMgr.c:1209: 错误: ‘struct _FrameMgr’没有名为‘iters’的成员
FrameMgr.c:1211: 错误: ‘struct _FrameIter’没有名为‘next’的成员
FrameMgr.c:1212: 错误: ‘struct _FrameIter’没有名为‘next’的成员
FrameMgr.c:1217: 错误: ‘struct _FrameMgr’没有名为‘iters’的成员
FrameMgr.c:1222: 错误: ‘struct _FrameIter’没有名为‘next’的成员
FrameMgr.c:1223: 错误: ‘struct _FrameIter’没有名为‘next’的成员
FrameMgr.c:1229: 错误: ‘struct _FrameIter’没有名为‘counting’的成员
FrameMgr.c:1229: 错误: ‘False’未声明(在此函数内第一次使用)
FrameMgr.c:1230: 错误: ‘struct _FrameIter’没有名为‘counter’的成员
FrameMgr.c:1231: 错误: ‘struct _FrameIter’没有名为‘end’的成员
FrameMgr.c:1232: 错误: ‘struct _FrameIter’没有名为‘next’的成员
FrameMgr.c: 在函数‘_FrameMgrRemoveIter’中:
FrameMgr.c:1244: 错误: ‘struct _FrameMgr’没有名为‘iters’的成员
FrameMgr.c:1250: 错误: ‘struct _FrameIter’没有名为‘next’的成员
FrameMgr.c:1250: 错误: ‘struct _FrameIter’没有名为‘next’的成员
FrameMgr.c:1252: 错误: ‘struct _FrameMgr’没有名为‘iters’的成员
FrameMgr.c:1252: 错误: ‘struct _FrameIter’没有名为‘next’的成员
FrameMgr.c:1259: 错误: ‘struct _FrameIter’没有名为‘next’的成员
FrameMgr.c: 在函数‘_FrameIterCounterIncr’中:
FrameMgr.c:1270: 错误: ‘struct _FrameIter’没有名为‘counting’的成员
FrameMgr.c:1272: 错误: ‘struct _FrameIter’没有名为‘counter’的成员
FrameMgr.c:1273: 错误: ‘struct _FrameIter’没有名为‘counter’的成员
FrameMgr.c:1273: 错误: ‘struct _FrameIter’没有名为‘end’的成员
FrameMgr.c:1275: 错误: ‘struct _Iter’没有名为‘allow_expansion’的成员
FrameMgr.c:1275: 错误: ‘False’未声明(在此函数内第一次使用)
FrameMgr.c:1281: 错误: ‘struct _FrameIter’没有名为‘next’的成员
FrameMgr.c: 在函数‘_IterStartWatch’中:
FrameMgr.c:1290: 错误: ‘struct _FrameIter’没有名为‘counting’的成员
FrameMgr.c:1290: 错误: ‘True’未声明(在此函数内第一次使用)
FrameMgr.c: 在函数‘IterInit’中:
FrameMgr.c:1510: 错误: ‘struct _Iter’没有名为‘allow_expansion’的成员
FrameMgr.c:1511: 错误: ‘struct _Iter’没有名为‘cur_no’的成员
FrameMgr.c:1512: 错误: ‘struct _Iter’没有名为‘start_watch_proc’的成员
FrameMgr.c:1513: 错误: ‘struct _Iter’没有名为‘client_data’的成员
FrameMgr.c:1514: 错误: ‘struct _Iter’没有名为‘start_counter’的成员
FrameMgr.c:1514: 错误: ‘False’未声明(在此函数内第一次使用)
FrameMgr.c:1537: 错误: ‘struct _Iter’没有名为‘cm’的成员
FrameMgr.c:1537: 错误: ‘struct _Iter’没有名为‘cm’的成员
FrameMgr.c: 在函数‘IterFree’中:
FrameMgr.c:1553: 错误: ‘struct _Iter’没有名为‘cm’的成员
FrameMgr.c:1562: 错误: ‘struct _Iter’没有名为‘cm’的成员
FrameMgr.c:1567: 错误: ‘struct _Iter’没有名为‘cm’的成员
FrameMgr.c:1577: 错误: ‘struct _Iter’没有名为‘cm’的成员
FrameMgr.c:1582: 错误: ‘struct _Iter’没有名为‘cm’的成员
FrameMgr.c: 在文件层:
FrameMgr.c:1593: 错误: expected ‘=’, ‘,’, ‘;’, ‘asm’ or ‘__attribute__’ before ‘IterIsLoopEnd’
FrameMgr.c: 在函数‘IterGetNextType’中:
FrameMgr.c:1654: 错误: ‘struct _Iter’没有名为‘start_counter’的成员
FrameMgr.c:1656: 错误: ‘struct _Iter’没有名为‘start_watch_proc’的成员
FrameMgr.c:1656: 错误: ‘struct _Iter’没有名为‘client_data’的成员
FrameMgr.c:1657: 错误: ‘struct _Iter’没有名为‘start_counter’的成员
FrameMgr.c:1657: 错误: ‘False’未声明(在此函数内第一次使用)
FrameMgr.c:1660: 错误: ‘struct _Iter’没有名为‘cur_no’的成员
FrameMgr.c:1662: 错误: ‘struct _Iter’没有名为‘allow_expansion’的成员
FrameMgr.c:1663: 错误: ‘struct _Iter’没有名为‘cur_no’的成员
FrameMgr.c:1676: 错误: ‘struct _Iter’没有名为‘cur_no’的成员
FrameMgr.c:1684: 错误: ‘struct _Iter’没有名为‘cm’的成员
FrameMgr.c:1684: 错误: ‘struct _Iter’没有名为‘cur_no’的成员
FrameMgr.c:1691: 错误: ‘struct _Iter’没有名为‘cur_no’的成员
FrameMgr.c:1700: 错误: ‘struct _Iter’没有名为‘cm’的成员
FrameMgr.c:1700: 错误: ‘struct _Iter’没有名为‘cur_no’的成员
FrameMgr.c:1703: 错误: ‘struct _Iter’没有名为‘cm’的成员
FrameMgr.c:1703: 错误: ‘struct _Iter’没有名为‘cur_no’的成员
FrameMgr.c:1710: 错误: ‘struct _Iter’没有名为‘cur_no’的成员
FrameMgr.c:1723: 错误: ‘struct _Iter’没有名为‘cm’的成员
FrameMgr.c:1723: 错误: ‘struct _Iter’没有名为‘cur_no’的成员
FrameMgr.c:1726: 错误: ‘struct _Iter’没有名为‘cm’的成员
FrameMgr.c:1726: 错误: ‘struct _Iter’没有名为‘cur_no’的成员
FrameMgr.c:1733: 错误: ‘struct _Iter’没有名为‘cur_no’的成员
FrameMgr.c: 在函数‘IterPeekNextType’中:
FrameMgr.c:1751: 错误: ‘struct _Iter’没有名为‘allow_expansion’的成员
FrameMgr.c:1751: 错误: ‘struct _Iter’没有名为‘cur_no’的成员
FrameMgr.c:1768: 错误: ‘struct _Iter’没有名为‘cm’的成员
FrameMgr.c:1768: 错误: ‘struct _Iter’没有名为‘cur_no’的成员
FrameMgr.c:1783: 错误: ‘struct _Iter’没有名为‘cm’的成员
FrameMgr.c:1783: 错误: ‘struct _Iter’没有名为‘cur_no’的成员
FrameMgr.c:1786: 错误: ‘struct _Iter’没有名为‘cm’的成员
FrameMgr.c:1786: 错误: ‘struct _Iter’没有名为‘cur_no’的成员
FrameMgr.c:1803: 错误: ‘struct _Iter’没有名为‘cm’的成员
FrameMgr.c:1803: 错误: ‘struct _Iter’没有名为‘cur_no’的成员
FrameMgr.c:1806: 错误: ‘struct _Iter’没有名为‘cm’的成员
FrameMgr.c:1806: 错误: ‘struct _Iter’没有名为‘cur_no’的成员
FrameMgr.c: 在函数‘IterSetSize’中:
FrameMgr.c:1830: 错误: ‘struct _Iter’没有名为‘allow_expansion’的成员
FrameMgr.c:1844: 错误: ‘struct _Iter’没有名为‘cm’的成员
FrameMgr.c:1847: 错误: ‘struct _Iter’没有名为‘cm’的成员
FrameMgr.c:1858: 错误: ‘struct _Iter’没有名为‘allow_expansion’的成员
FrameMgr.c:1863: 错误: ‘struct _Iter’没有名为‘cm’的成员
FrameMgr.c:1879: 错误: ‘struct _Iter’没有名为‘cm’的成员
FrameMgr.c:1882: 错误: ‘struct _Iter’没有名为‘cm’的成员
FrameMgr.c:1890: 错误: ‘struct _Iter’没有名为‘allow_expansion’的成员
FrameMgr.c:1895: 错误: ‘struct _Iter’没有名为‘cm’的成员
FrameMgr.c:1913: 错误: ‘struct _Iter’没有名为‘cm’的成员
FrameMgr.c:1916: 错误: ‘struct _Iter’没有名为‘cm’的成员
FrameMgr.c:1924: 错误: ‘struct _Iter’没有名为‘allow_expansion’的成员
FrameMgr.c:1929: 错误: ‘struct _Iter’没有名为‘cm’的成员
FrameMgr.c: 在函数‘IterGetSize’中:
FrameMgr.c:1953: 错误: ‘struct _Iter’没有名为‘cur_no’的成员
FrameMgr.c:1960: 错误: ‘struct _Iter’没有名为‘cm’的成员
FrameMgr.c:1960: 错误: ‘struct _Iter’没有名为‘cur_no’的成员
FrameMgr.c:1966: 错误: ‘struct _Iter’没有名为‘cur_no’的成员
FrameMgr.c:1970: 错误: ‘struct _Iter’没有名为‘cm’的成员
FrameMgr.c:1973: 错误: ‘struct _Iter’没有名为‘cm’的成员
FrameMgr.c:1985: 错误: ‘struct _Iter’没有名为‘cur_no’的成员
FrameMgr.c:1989: 错误: ‘struct _Iter’没有名为‘cm’的成员
FrameMgr.c:1992: 错误: ‘struct _Iter’没有名为‘cm’的成员
FrameMgr.c: 在函数‘IterSetIterCount’中:
FrameMgr.c:2014: 错误: ‘struct _Iter’没有名为‘allow_expansion’的成员
FrameMgr.c:2017: 错误: ‘struct _Iter’没有名为‘allow_expansion’的成员
FrameMgr.c:2017: 错误: ‘False’未声明(在此函数内第一次使用)
FrameMgr.c:2034: 错误: ‘struct _Iter’没有名为‘cm’的成员
FrameMgr.c:2037: 错误: ‘struct _Iter’没有名为‘cm’的成员
FrameMgr.c:2046: 错误: ‘struct _Iter’没有名为‘allow_expansion’的成员
FrameMgr.c:2051: 错误: ‘struct _Iter’没有名为‘cm’的成员
FrameMgr.c:2065: 错误: ‘struct _Iter’没有名为‘cm’的成员
FrameMgr.c:2068: 错误: ‘struct _Iter’没有名为‘cm’的成员
FrameMgr.c:2076: 错误: ‘struct _Iter’没有名为‘allow_expansion’的成员
FrameMgr.c:2081: 错误: ‘struct _Iter’没有名为‘cm’的成员
FrameMgr.c: 在函数‘IterGetTotalSize’中:
FrameMgr.c:2103: 错误: ‘struct _Iter’没有名为‘allow_expansion’的成员
FrameMgr.c:2137: 错误: ‘struct _Iter’没有名为‘cm’的成员
FrameMgr.c:2154: 错误: ‘struct _Iter’没有名为‘cm’的成员
FrameMgr.c:2172: 错误: ‘struct _Iter’没有名为‘cm’的成员
FrameMgr.c:2175: 错误: ‘struct _Iter’没有名为‘cm’的成员
FrameMgr.c: 在函数‘IterReset’中:
FrameMgr.c:2202: 错误: ‘struct _Iter’没有名为‘cm’的成员
FrameMgr.c:2210: 错误: ‘struct _Iter’没有名为‘cm’的成员
FrameMgr.c:2221: 错误: ‘struct _Iter’没有名为‘cur_no’的成员
FrameMgr.c: 在函数‘IterSetStartWatch’中:
FrameMgr.c:2228: 错误: ‘struct _Iter’没有名为‘start_watch_proc’的成员
FrameMgr.c:2229: 错误: ‘struct _Iter’没有名为‘client_data’的成员
FrameMgr.c: 在文件层:
FrameMgr.c:2272: 错误: expected ‘=’, ‘,’, ‘;’, ‘asm’ or ‘__attribute__’ before ‘ChainIterGetNext’
make[2]: *** [FrameMgr.o] 错误 1
make[2]:正在离开目录 `/tmp/fcitx-3.6/lib'
make[1]: *** [all-recursive] 错误 1
make[1]:正在离开目录 `/tmp/fcitx-3.6'
make: *** [all] 错误 2


页首
 用户资料  
 
2 楼 
 文章标题 : Re: fcitx编译错误,是编译器的原因吗?
帖子发表于 : 2009-08-17 3:09 
头像

注册: 2007-10-23 12:54
帖子: 1689
送出感谢: 0 次
接收感谢: 13
编译之前要先准备编译环境
sudo apt-get build-dep fcitx


页首
 用户资料  
 
3 楼 
 文章标题 : Re: fcitx编译错误,是编译器的原因吗?
帖子发表于 : 2009-08-18 2:46 

注册: 2009-08-10 20:19
帖子: 17
送出感谢: 0 次
接收感谢: 0 次
AutoXBC 写道:
编译之前要先准备编译环境
sudo apt-get build-dep fcitx

我用了这个后,再make,还是有错误,现在是什么原因?
make all-recursive
make[1]: 正在进入目录 `/tmp/fcitx-3.6'
Making all in doc
make[2]: 正在进入目录 `/tmp/fcitx-3.6/doc'
make[2]: 没有什么可以做的为 `all'。
make[2]:正在离开目录 `/tmp/fcitx-3.6/doc'
Making all in xpm
make[2]: 正在进入目录 `/tmp/fcitx-3.6/xpm'
make[2]: 没有什么可以做的为 `all'。
make[2]:正在离开目录 `/tmp/fcitx-3.6/xpm'
Making all in lib
make[2]: 正在进入目录 `/tmp/fcitx-3.6/lib'
gcc -DHAVE_CONFIG_H -I. -I.. -c -O2 -fno-strength-reduce -fno-strict-aliasing -g -O2 -D_ENABLE_TRAY -I/usr/include/freetype2 -D_USE_XFT -Wall -MT IMConn.o -MD -MP -MF .deps/IMConn.Tpo -c -o IMConn.o IMConn.c
mv -f .deps/IMConn.Tpo .deps/IMConn.Po
rm -f libXimd.a
ar cru libXimd.a FrameMgr.o i18nAttr.o i18nClbk.o i18nIc.o i18nIMProto.o i18nMethod.o i18nPtHdr.o i18nUtil.o i18nX.o IMConn.o IMMethod.o IMValues.o
ranlib libXimd.a
make[2]:正在离开目录 `/tmp/fcitx-3.6/lib'
Making all in src
make[2]: 正在进入目录 `/tmp/fcitx-3.6/src'
gcc -DPKGDATADIR=\"/home/zyue/application/share/fcitx\" -I. -I.. -I. -I../lib -I../xpm -O2 -fno-strength-reduce -g -O2 -D_ENABLE_TRAY -I/usr/include/freetype2 -D_USE_XFT -Wall -MT ime.o -MD -MP -MF .deps/ime.Tpo -c -o ime.o ime.c
在包含自 ime.c:42 的文件中:
TrayWindow.h:7:34: 错误: X11/extensions/shape.h:没有该文件或目录
make[2]: *** [ime.o] 错误 1
make[2]:正在离开目录 `/tmp/fcitx-3.6/src'
make[1]: *** [all-recursive] 错误 1
make[1]:正在离开目录 `/tmp/fcitx-3.6'
make: *** [all] 错误 2


页首
 用户资料  
 
4 楼 
 文章标题 : Re: fcitx编译错误,是编译器的原因吗?
帖子发表于 : 2009-08-18 4:09 
头像

注册: 2007-10-23 12:54
帖子: 1689
送出感谢: 0 次
接收感谢: 13
直接原因是缺少这个包 x11proto-xext-dev 。不过理论上上面那条命令应该会避免这个错误的出现。

论坛有很多现成的 deb 包,可以搜索一下,不一定要自己编译,而且 Ubuntu 也不鼓励用户自己编译。


页首
 用户资料  
 
5 楼 
 文章标题 : Re: fcitx编译错误,是编译器的原因吗?
帖子发表于 : 2009-08-22 23:56 
头像

注册: 2006-06-06 22:56
帖子: 80
送出感谢: 0 次
接收感谢: 0 次
是因为缺少了libxtst-dev包,这个包包含头文件,编译时会用上。
你从源里安装libxtst6-dev就可以了, 我的版本是9.04


页首
 用户资料  
 
显示帖子 :  排序  
发表新帖 回复这个主题  [ 5 篇帖子 ] 

当前时区为 UTC + 8 小时


在线用户

正在浏览此版面的用户:没有注册用户 和 4 位游客


不能 在这个版面发表主题
不能 在这个版面回复主题
不能 在这个版面编辑帖子
不能 在这个版面删除帖子
不能 在这个版面提交附件

前往 :  
本站点为公益性站点,用于推广开源自由软件,由 DiaHosting VPSBudgetVM VPS 提供服务。
我们认为:软件应可免费取得,软件工具在各种语言环境下皆可使用,且不会有任何功能上的差异;
人们应有定制和修改软件的自由,且方式不受限制,只要他们自认为合适。

Powered by phpBB © 2000, 2002, 2005, 2007 phpBB Group
简体中文语系由 王笑宇 翻译