当前时区为 UTC + 8 小时



发表新帖 回复这个主题  [ 3 篇帖子 ] 
作者 内容
1 楼 
 文章标题 : [问题]从源代码安装dillo出现问题
帖子发表于 : 2007-11-25 9:40 
头像

注册: 2007-11-10 23:33
帖子: 49
送出感谢: 0 次
接收感谢: 0 次
最近从网上看到有帖介绍dillo的 感到很新奇,所以准备安装,开始是提示缺少glib,g++等,就都从源里安装的了,make时出现问题,我把错误帖出来,懂得的帮助一下, 网上实在没找到相关帮助,谢谢。
引用:
downloads.cc:34:22: 错误: fltk/run.h:No such file or directory
downloads.cc:35:25: 错误: fltk/Window.h:No such file or directory
downloads.cc:36:25: 错误: fltk/Widget.h:No such file or directory
downloads.cc:37:25: 错误: fltk/damage.h:No such file or directory
downloads.cc:38:22: 错误: fltk/Box.h:No such file or directory
downloads.cc:39:23: 错误: fltk/draw.h:No such file or directory
downloads.cc:40:34: 错误: fltk/HighlightButton.h:No such file or directory
downloads.cc:41:30: 错误: fltk/PackedGroup.h:No such file or directory
downloads.cc:42:30: 错误: fltk/ScrollGroup.h:No such file or directory
downloads.cc:43:22: 错误: fltk/ask.h:No such file or directory
downloads.cc:44:31: 错误: fltk/file_chooser.h:No such file or directory
downloads.cc:49: 错误: ‘fltk’ 不是一个命名空间
downloads.cc:49: 错误: expected namespace-name before ‘;’ token
downloads.cc:75: 错误: expected class-name before ‘{’ token
downloads.cc:83: 错误: ‘Color’ 没有命名一个类型
downloads.cc:102: 错误: ‘Color’ 未声明
downloads.cc:103: 错误: ‘Color’ 没有命名一个类型
downloads.cc: In member function ‘void ProgressBar::step(double)’:
downloads.cc:90: 错误: ‘redraw’ 在此作用域中尚未声明
downloads.cc: In member function ‘void ProgressBar::position(double)’:
downloads.cc:98: 错误: ‘redraw’ 在此作用域中尚未声明
downloads.cc: In member function ‘void ProgressBar::message(char*)’:
downloads.cc:100: 错误: ‘redraw’ 在此作用域中尚未声明
downloads.cc: In member function ‘void ProgressBar::text_color(int)’:
downloads.cc:102: 错误: ‘mTextColor’ 在此作用域中尚未声明
downloads.cc: At global scope:
downloads.cc:128: 错误: ISO C++ 不允许声明无类型的 ‘Group’
downloads.cc:128: 错误: expected ‘;’ before ‘*’ token
downloads.cc:130: 错误: ISO C++ 不允许声明无类型的 ‘HighlightButton’
downloads.cc:130: 错误: expected ‘;’ before ‘*’ token
downloads.cc:131: 错误: ISO C++ 不允许声明无类型的 ‘Widget’
downloads.cc:131: 错误: expected ‘;’ before ‘*’ token
downloads.cc:147: 错误: ISO C++ 不允许声明无类型的 ‘Widget’
downloads.cc:147: 错误: expected ‘;’ before ‘*’ token
downloads.cc:148: 错误: expected `;' before ‘int’
downloads.cc:182: 错误: ISO C++ 不允许声明无类型的 ‘Window’
downloads.cc:182: 错误: expected ‘;’ before ‘*’ token
downloads.cc:183: 错误: ISO C++ 不允许声明无类型的 ‘ScrollGroup’
downloads.cc:183: 错误: expected ‘;’ before ‘*’ token
downloads.cc:184: 错误: ISO C++ 不允许声明无类型的 ‘PackedGroup’
downloads.cc:184: 错误: expected ‘;’ before ‘*’ token
downloads.cc: In member function ‘void DLWin::show()’:
downloads.cc:193: 错误: ‘mWin’ 在此作用域中尚未声明
downloads.cc: In member function ‘void DLWin::hide()’:
downloads.cc:194: 错误: ‘mWin’ 在此作用域中尚未声明
downloads.cc: In member function ‘void ProgressBar::move(double)’:
downloads.cc:222: 错误: ‘redraw’ 在此作用域中尚未声明
downloads.cc: In constructor ‘ProgressBar::ProgressBar(int, int, int, int, const char*)’:
downloads.cc:226: 错误: 类 ‘ProgressBar’ 没有名为 ‘Widget’ 的字段
downloads.cc:232: 错误: ‘DOWN_BOX’ 在此作用域中尚未声明
downloads.cc:232: 错误: ‘box’ 在此作用域中尚未声明
downloads.cc:233: 错误: ‘BLUE’ 在此作用域中尚未声明
downloads.cc:233: 错误: ‘selection_color’ 在此作用域中尚未声明
downloads.cc:234: 错误: ‘WHITE’ 在此作用域中尚未声明
downloads.cc:234: 错误: ‘color’ 在此作用域中尚未声明
downloads.cc:235: 错误: ‘RED’ 在此作用域中尚未声明
downloads.cc:235: 错误: ‘textcolor’ 在此作用域中尚未声明
downloads.cc: In member function ‘void ProgressBar::draw()’:
downloads.cc:240: 错误: ‘style’ 在此作用域中尚未声明
downloads.cc:240: 错误: ‘flags’ 在此作用域中尚未声明
downloads.cc:240: 错误: ‘drawstyle’ 在此作用域中尚未声明
downloads.cc:241: 错误: ‘damage’ 在此作用域中尚未声明
downloads.cc:241: 错误: ‘DAMAGE_ALL’ 在此作用域中尚未声明
downloads.cc:242: 错误: ‘draw_box’ 在此作用域中尚未声明
downloads.cc:243: 错误: ‘Rectangle’ 在此作用域中尚未声明
downloads.cc:243: 错误: expected `;' before ‘r’
downloads.cc:244: 错误: ‘box’ 在此作用域中尚未声明
downloads.cc:244: 错误: ‘r’ 在此作用域中尚未声明
downloads.cc:251: 错误: ‘vertical’ 在此作用域中尚未声明
downloads.cc:259: 错误: ‘selection_color’ 在此作用域中尚未声明
downloads.cc:259: 错误: ‘setcolor’ 在此作用域中尚未声明
downloads.cc:262: 错误: ‘fillrect’ 在此作用域中尚未声明
downloads.cc:264: 错误: expected `;' before ‘r2’
downloads.cc:265: 错误: ‘r2’ 在此作用域中尚未声明
downloads.cc:265: 错误: ‘push_clip’ 在此作用域中尚未声明
downloads.cc:266: 错误: ‘fillrect’ 在此作用域中尚未声明
downloads.cc:267: 错误: ‘pop_clip’ 在此作用域中尚未声明
downloads.cc:271: 错误: ‘textcolor’ 在此作用域中尚未声明
downloads.cc:272: 错误: ‘class ProgressBar’ 没有名为 ‘labelfont’ 的成员
downloads.cc:272: 错误: ‘class ProgressBar’ 没有名为 ‘labelsize’ 的成员
downloads.cc:272: 错误: ‘setfont’ 在此作用域中尚未声明
downloads.cc:273: 错误: ‘w’ 在此作用域中尚未声明
downloads.cc:273: 错误: ‘h’ 在此作用域中尚未声明
downloads.cc:273: 错误: ‘ALIGN_CENTER’ 在此作用域中尚未声明
downloads.cc:273: 错误: ‘drawtext’ 在此作用域中尚未声明
downloads.cc:277: 错误: ‘textcolor’ 在此作用域中尚未声明
downloads.cc:278: 错误: ‘class ProgressBar’ 没有名为 ‘labelfont’ 的成员
downloads.cc:278: 错误: ‘class ProgressBar’ 没有名为 ‘labelsize’ 的成员
downloads.cc:278: 错误: ‘setfont’ 在此作用域中尚未声明
downloads.cc:279: 错误: ‘w’ 在此作用域中尚未声明
downloads.cc:279: 错误: ‘h’ 在此作用域中尚未声明
downloads.cc:279: 错误: ‘ALIGN_CENTER’ 在此作用域中尚未声明
downloads.cc:279: 错误: ‘drawtext’ 在此作用域中尚未声明
downloads.cc: At global scope:
downloads.cc:286: 错误: 变量或字段 ‘prButton_scb’ 声明为 void
downloads.cc:286: 错误: ‘Widget’ 在此作用域中尚未声明
downloads.cc:286: 错误: expected primary-expression before ‘,’ token
downloads.cc:286: 错误: expected primary-expression before ‘void’
downloads.cc:286: 错误: initializer 表达式列表被看作复合表达式
downloads.cc:287: 错误: expected ‘,’ or ‘;’ before ‘{’ token
downloads.cc: In constructor ‘DLItem::DLItem(const char*, const char*, DLAction)’:
downloads.cc:352: 错误: ‘group’ 在此作用域中尚未声明
downloads.cc:352: 错误: expected type-specifier before ‘Group’
downloads.cc:352: 错误: expected `;' before ‘Group’
downloads.cc:354: 错误: ‘prTitle’ 在此作用域中尚未声明
downloads.cc:354: 错误: expected type-specifier before ‘Widget’
downloads.cc:354: 错误: expected `;' before ‘Widget’
downloads.cc:355: 错误: ‘fltk’ 未声明
downloads.cc:356: 错误: ‘ALIGN_LEFT’ 在此作用域中尚未声明
downloads.cc:356: 错误: ‘ALIGN_INSIDE’ 在此作用域中尚未声明
downloads.cc:356: 错误: ‘ALIGN_CLIP’ 在此作用域中尚未声明
downloads.cc:363: 错误: ‘class ProgressBar’ 没有名为 ‘box’ 的成员
downloads.cc:363: 错误: ‘BORDER_BOX’ 在此作用域中尚未声明
downloads.cc:364: 错误: ‘class ProgressBar’ 没有名为 ‘tooltip’ 的成员
downloads.cc:367: 错误: ‘Widget’ 在此作用域中尚未声明
downloads.cc:367: 错误: ‘o’ 在此作用域中尚未声明
downloads.cc:367: 错误: expected type-specifier before ‘Widget’
downloads.cc:367: 错误: expected `;' before ‘Widget’
downloads.cc:368: 错误: ‘RFLAT_BOX’ 在此作用域中尚未声明
downloads.cc:369: 错误: ‘Color’ 在此作用域中尚未声明
downloads.cc:371: 错误: ‘prGot’ 在此作用域中尚未声明
downloads.cc:371: 错误: expected type-specifier before ‘Widget’
downloads.cc:371: 错误: expected `;' before ‘Widget’
downloads.cc:372: 错误: expected `)' before numeric constant
downloads.cc:373: 错误: ‘fltk’ 未声明
downloads.cc:376: 错误: expected type-specifier before ‘Widget’
downloads.cc:376: 错误: expected `;' before ‘Widget’
downloads.cc:378: 错误: expected `)' before numeric constant
downloads.cc:380: 错误: ‘prSize’ 在此作用域中尚未声明
downloads.cc:380: 错误: expected type-specifier before ‘Widget’
downloads.cc:380: 错误: expected `;' before ‘Widget’
downloads.cc:381: 错误: ‘fltk’ 未声明
downloads.cc:384: 错误: expected type-specifier before ‘Widget’
downloads.cc:384: 错误: expected `;' before ‘Widget’
downloads.cc:386: 错误: expected `)' before numeric constant
downloads.cc:388: 错误: ‘prRate’ 在此作用域中尚未声明
downloads.cc:388: 错误: expected type-specifier before ‘Widget’
downloads.cc:388: 错误: expected `;' before ‘Widget’
downloads.cc:389: 错误: ‘fltk’ 未声明
downloads.cc:392: 错误: expected type-specifier before ‘Widget’
downloads.cc:392: 错误: expected `;' before ‘Widget’
downloads.cc:394: 错误: expected `)' before numeric constant
downloads.cc:396: 错误: ‘pr_Rate’ 在此作用域中尚未声明
downloads.cc:396: 错误: expected type-specifier before ‘Widget’
downloads.cc:396: 错误: expected `;' before ‘Widget’
downloads.cc:397: 错误: ‘fltk’ 未声明
downloads.cc:400: 错误: ‘prETAt’ 在此作用域中尚未声明
downloads.cc:400: 错误: expected type-specifier before ‘Widget’
downloads.cc:400: 错误: expected `;' before ‘Widget’
downloads.cc:402: 错误: expected `)' before numeric constant
downloads.cc:404: 错误: ‘prETA’ 在此作用域中尚未声明
downloads.cc:404: 错误: expected type-specifier before ‘Widget’
downloads.cc:404: 错误: expected `;' before ‘Widget’
downloads.cc:405: 错误: ‘fltk’ 未声明
downloads.cc:409: 错误: ‘prButton’ 在此作用域中尚未声明
downloads.cc:409: 错误: expected type-specifier before ‘HighlightButton’
downloads.cc:409: 错误: expected `;' before ‘HighlightButton’
downloads.cc:411: 错误: ‘UP_BOX’ 在此作用域中尚未声明
downloads.cc:416: 错误: ‘ROUND_UP_BOX’ 在此作用域中尚未声明
downloads.cc: In destructor ‘DLItem::~DLItem()’:
downloads.cc:431: 错误: ‘group’ 在此作用域中尚未声明
downloads.cc: In member function ‘void DLItem::abort_dl()’:
downloads.cc:441: 错误: ‘remove_fd’ 在此作用域中尚未声明
downloads.cc: In member function ‘void DLItem::prButton_cb()’:
downloads.cc:452: 错误: ‘prButton’ 在此作用域中尚未声明
downloads.cc: In member function ‘void DLItem::update_prSize(int)’:
downloads.cc:479: 错误: ‘prSize’ 在此作用域中尚未声明
downloads.cc: In member function ‘void DLItem::log_text_add(char*, ssize_t)’:
downloads.cc:492: 错误: ‘prTitle’ 在此作用域中尚未声明
downloads.cc:548: 错误: ‘prTitle’ 在此作用域中尚未声明
downloads.cc: In member function ‘void DLItem::update_size(int)’:
downloads.cc:567: 错误: ‘prTitle’ 在此作用域中尚未声明
downloads.cc:576: 错误: ‘prGot’ 在此作用域中尚未声明
downloads.cc: In function ‘void read_log_cb(int, void*)’:
downloads.cc:607: 错误: ‘remove_fd’ 在此作用域中尚未声明
downloads.cc: In member function ‘void DLItem::father_init()’:
downloads.cc:620: 错误: ‘add_fd’ 在此作用域中尚未声明
downloads.cc: In member function ‘void DLItem::child_finished(int)’:
downloads.cc:635: 错误: ‘prButton’ 在此作用域中尚未声明
downloads.cc:638: 错误: ‘prButton’ 在此作用域中尚未声明
downloads.cc:643: 错误: ‘prTitle’ 在此作用域中尚未声明
downloads.cc:647: 错误: ‘prButton’ 在此作用域中尚未声明
downloads.cc: In member function ‘void DLItem::update()’:
downloads.cc:700: 错误: ‘prRate’ 在此作用域中尚未声明
downloads.cc:707: 错误: ‘pr_Rate’ 在此作用域中尚未声明
downloads.cc:714: 错误: ‘prETAt’ 在此作用域中尚未声明
downloads.cc:718: 错误: ‘prETA’ 在此作用域中尚未声明
downloads.cc:728: 错误: ‘prETA’ 在此作用域中尚未声明
downloads.cc:731: 错误: ‘prETA’ 在此作用域中尚未声明
downloads.cc: In function ‘void cleanup_cb(void*)’:
downloads.cc:787: 错误: ‘repeat_timeout’ 在此作用域中尚未声明
downloads.cc: In function ‘void update_cb(void*)’:
downloads.cc:814: 错误: ‘repeat_timeout’ 在此作用域中尚未声明
downloads.cc: At global scope:
downloads.cc:945: 错误: 变量或字段 ‘dlwin_esc_cb’ 声明为 void
downloads.cc:945: 错误: ‘Widget’ 在此作用域中尚未声明
downloads.cc:945: 错误: expected primary-expression before ‘,’ token
downloads.cc:945: 错误: expected primary-expression before ‘void’
downloads.cc:945: 错误: initializer 表达式列表被看作复合表达式
downloads.cc:946: 错误: expected ‘,’ or ‘;’ before ‘{’ token
downloads.cc: In member function ‘void DLWin::add(const char*, const char*, DLAction)’:
downloads.cc:969: 错误: ‘mPG’ 在此作用域中尚未声明
downloads.cc:969: 错误: ‘class DLItem’ 没有名为 ‘get_widget’ 的成员
downloads.cc: In member function ‘DLAction DLWin::check_filename(char**)’:
downloads.cc:1007: 错误: ‘fltk’ 未声明
downloads.cc:1012: 错误: ‘fltk’ 未声明
downloads.cc: In member function ‘void DLWin::del(int)’:
downloads.cc:1033: 错误: ‘mPG’ 在此作用域中尚未声明
downloads.cc:1033: 错误: ‘class DLItem’ 没有名为 ‘get_widget’ 的成员
downloads.cc:1035: 错误: ‘mWin’ 在此作用域中尚未声明
downloads.cc: In member function ‘void DLWin::listen(int)’:
downloads.cc:1067: 错误: ‘add_fd’ 在此作用域中尚未声明
downloads.cc: In constructor ‘DLWin::DLWin(int, int)’:
downloads.cc:1088: 错误: ‘mWin’ 在此作用域中尚未声明
downloads.cc:1088: 错误: expected type-specifier before ‘Window’
downloads.cc:1088: 错误: expected `;' before ‘Window’
downloads.cc:1090: 错误: ‘mScroll’ 在此作用域中尚未声明
downloads.cc:1090: 错误: expected type-specifier before ‘ScrollGroup’
downloads.cc:1090: 错误: expected `;' before ‘ScrollGroup’
downloads.cc:1092: 错误: ‘mPG’ 在此作用域中尚未声明
downloads.cc:1092: 错误: expected type-specifier before ‘PackedGroup’
downloads.cc:1092: 错误: expected `;' before ‘PackedGroup’
downloads.cc:1107: 错误: ‘add_timeout’ 在此作用域中尚未声明
downloads.cc: In function ‘int main()’:
downloads.cc:1122: 错误: ‘lock’ 在此作用域中尚未声明
downloads.cc:1132: 错误: ‘run’ 在此作用域中尚未声明
make[2]: *** [downloads.o] 错误 1
make[2]: Leaving directory `/home/heromac/dillo/dillo-0.8.6/dpi'
make[1]: *** [all-recursive] 错误 1
make[1]: Leaving directory `/home/heromac/dillo/dillo-0.8.6'
make: *** [all] 错误 2


页首
 用户资料  
 
2 楼 
 文章标题 :
帖子发表于 : 2007-11-25 10:41 
头像

注册: 2006-01-25 22:29
帖子: 1322
地址: 上海
送出感谢: 0 次
接收感谢: 0 次
把./configure的结果贴出来。。。
lz有没有sudo apt-get install build-essential过?


页首
 用户资料  
 
3 楼 
 文章标题 :
帖子发表于 : 2007-11-26 18:22 
头像

注册: 2007-11-10 23:33
帖子: 49
送出感谢: 0 次
接收感谢: 0 次
build-essential已经安装了
config.log放在附件里了,各位好心人帮忙看看。
谢谢了


附件:
文件注释: dillo ./configure之后的config.log
make中出现的错误如第一帖所示

config.tar [40 KiB]
被下载 3 次
页首
 用户资料  
 
显示帖子 :  排序  
发表新帖 回复这个主题  [ 3 篇帖子 ] 

当前时区为 UTC + 8 小时


在线用户

正在浏览此版面的用户:没有注册用户 和 4 位游客


不能 在这个版面发表主题
不能 在这个版面回复主题
不能 在这个版面编辑帖子
不能 在这个版面删除帖子
不能 在这个版面提交附件

前往 :  
本站点为公益性站点,用于推广开源自由软件,由 DiaHosting VPSBudgetVM VPS 提供服务。
我们认为:软件应可免费取得,软件工具在各种语言环境下皆可使用,且不会有任何功能上的差异;
人们应有定制和修改软件的自由,且方式不受限制,只要他们自认为合适。

Powered by phpBB © 2000, 2002, 2005, 2007 phpBB Group
简体中文语系由 王笑宇 翻译