圣诞节快乐 发部分acer 富士通等笔记本 快捷键 驱动模块 需要的来看看 哦`~

笔记本/超便携移动PC软硬件相关支持,包括硬件、安装和驱动等
回复
头像
晶晶守护神
帖子: 705
注册时间: 2007-12-02 14:09
送出感谢: 0
接收感谢: 0

圣诞节快乐 发部分acer 富士通等笔记本 快捷键 驱动模块 需要的来看看 哦`~

#1

帖子 晶晶守护神 » 2007-12-24 22:06

~~~~~~~~~~~
去掉后面.bz2 再解压~~~
附件
acerhk-0.5.35.tgz.bz2
(35.99 KiB) 下载 125 次
悟以往之不鉴,知来者之可追
识迷途其未远 觉今是而昨非
头像
晶晶守护神
帖子: 705
注册时间: 2007-12-02 14:09
送出感谢: 0
接收感谢: 0

#2

帖子 晶晶守护神 » 2007-12-24 22:07

Acer Travelmate
Acer Aspire
Other
C100
C110
C300
200
210
220/260
230/280
240
250
260
290
350
360
370
380
420
430
520
530
540
610
620
630
650
660
800
2410
3200
2300/4000/4500
2350/4050
4100/4600
4150/4650 (force_series needed)
8000
1300
1310
1350
1360
1400
1410
1450
1500
1600
1680
1690
1700
1800
2000
2010
2020
3020
5020
5610 (force_series=2020)
9500

Acer Extensa 3000
Acer Extensa 4100 (force_series=4100)
Acer Ferrari 3000 (which is an Aspire 1450 in fact)

AOpen

Fujitsu Siemens Amilo D
Fujitsu Siemens Amilo M (7400)
Fujitsu Siemens Amilo 7820
Fujitsu Siemens Amilo Pro (V2000)

Medion MD 2900 (no autodetection, use force_series=2900)
Medion MD 9783
Medion MD 40100 - more info
Medion MD 41300
Medion MD 42200
Medion MD 49400
Medion MD 95400
Medion MD 96500
Medion MD 97000

Compal CL 56 (or similar)

Prestigio Nobile 151
Prestigio Nobile 156
Prestigio Nobile 157





附上英文网站地址 http://www.cakey.de/acerhk/
悟以往之不鉴,知来者之可追
识迷途其未远 觉今是而昨非
头像
carbont
帖子: 3406
注册时间: 2007-11-22 10:20
来自: 北京
送出感谢: 0
接收感谢: 1 次

#3

帖子 carbont » 2007-12-24 22:10

IBM ThinkPad……
我的音量图标……
lenovo Thinkpad R60i 0657 LHC
windowsXP……准备换回ubuntu了。

Twitter: @carbont
头像
晶晶守护神
帖子: 705
注册时间: 2007-12-02 14:09
送出感谢: 0
接收感谢: 0

#4

帖子 晶晶守护神 » 2007-12-24 22:14

楼上说的啥子~~哪里有图标~~
悟以往之不鉴,知来者之可追
识迷途其未远 觉今是而昨非
头像
carbont
帖子: 3406
注册时间: 2007-11-22 10:20
来自: 北京
送出感谢: 0
接收感谢: 1 次

#5

帖子 carbont » 2007-12-24 22:41

我想要TP的文件……
我就是没有音量的Gnome的图标,亮度的都有的。
lenovo Thinkpad R60i 0657 LHC
windowsXP……准备换回ubuntu了。

Twitter: @carbont
头像
晶晶守护神
帖子: 705
注册时间: 2007-12-02 14:09
送出感谢: 0
接收感谢: 0

#6

帖子 晶晶守护神 » 2007-12-24 22:48

:em25
悟以往之不鉴,知来者之可追
识迷途其未远 觉今是而昨非
andrew_t
帖子: 614
注册时间: 2006-12-14 3:00
送出感谢: 0
接收感谢: 0
联系:

#7

帖子 andrew_t » 2007-12-25 0:08

我的acer aspire 5583装好了快捷键基本都能用呢,要什么驱动模块
头像
晶晶守护神
帖子: 705
注册时间: 2007-12-02 14:09
送出感谢: 0
接收感谢: 0

#8

帖子 晶晶守护神 » 2007-12-25 0:11

不是每个人的acer 都能用~~
悟以往之不鉴,知来者之可追
识迷途其未远 觉今是而昨非
sczlin
帖子: 97
注册时间: 2006-04-06 11:23
送出感谢: 0
接收感谢: 0

#9

帖子 sczlin » 2007-12-25 9:29

我的本本无法调节屏幕亮度!!!
HP COMPAQ NX 6325

AMD双核心炫龙x2 集成ati xpress 1150显卡

2048M内存,80G硬盘
viperking
帖子: 2
注册时间: 2008-05-17 11:22
送出感谢: 0
接收感谢: 0

#10

帖子 viperking » 2008-05-17 11:30

sorry can't type chinese yet.
why when i downloaded the source and run "make",
it shows :
scripts/Makefile.build:46: *** CFLAGS was changed in "/home/viperking/acerhk-0.5.35/Makefile". Fix it to use EXTRA_CFLAGS. Stop.


Thanks!!
viperking
帖子: 2
注册时间: 2008-05-17 11:22
送出感谢: 0
接收感谢: 0

#11

帖子 viperking » 2008-05-17 11:37

After I use "sudo make", it shows below: (used in ubuntu 8.04)


make -C /lib/modules/`uname -r`/build SUBDIRS= modules
make[1]: Entering directory `/usr/src/linux-headers-2.6.24-16-generic'
CHK include/linux/version.h
CHK include/linux/utsrelease.h
HOSTCC scripts/basic/fixdep
scripts/basic/fixdep.c:107:23: error: sys/types.h: No such file or directory
scripts/basic/fixdep.c:108:22: error: sys/stat.h: No such file or directory
scripts/basic/fixdep.c:109:22: error: sys/mman.h: No such file or directory
scripts/basic/fixdep.c:110:20: error: unistd.h: No such file or directory
scripts/basic/fixdep.c:111:19: error: fcntl.h: No such file or directory
scripts/basic/fixdep.c:112:20: error: string.h: No such file or directory
scripts/basic/fixdep.c:113:20: error: stdlib.h: No such file or directory
scripts/basic/fixdep.c:114:19: error: stdio.h: No such file or directory
In file included from /usr/lib/gcc/i486-linux-gnu/4.2.3/include/syslimits.h:7,
from /usr/lib/gcc/i486-linux-gnu/4.2.3/include/limits.h:11,
from scripts/basic/fixdep.c:115:
/usr/lib/gcc/i486-linux-gnu/4.2.3/include/limits.h:122:61: error: limits.h: No such file or directory
scripts/basic/fixdep.c:116:19: error: ctype.h: No such file or directory
scripts/basic/fixdep.c:117:23: error: arpa/inet.h: No such file or directory
scripts/basic/fixdep.c: In function ‘usage’:
scripts/basic/fixdep.c:131: warning: implicit declaration of function ‘fprintf’
scripts/basic/fixdep.c:131: warning: incompatible implicit declaration of built-in function ‘fprintf’
scripts/basic/fixdep.c:131: error: ‘stderr’ undeclared (first use in this function)
scripts/basic/fixdep.c:131: error: (Each undeclared identifier is reported only once
scripts/basic/fixdep.c:131: error: for each function it appears in.)
scripts/basic/fixdep.c:132: warning: implicit declaration of function ‘exit’
scripts/basic/fixdep.c:132: warning: incompatible implicit declaration of built-in function ‘exit’
scripts/basic/fixdep.c: In function ‘print_cmdline’:
scripts/basic/fixdep.c:140: warning: implicit declaration of function ‘printf’
scripts/basic/fixdep.c:140: warning: incompatible implicit declaration of built-in function ‘printf’
scripts/basic/fixdep.c: At top level:
scripts/basic/fixdep.c:143: error: ‘NULL’ undeclared here (not in a function)
scripts/basic/fixdep.c: In function ‘grow_config’:
scripts/basic/fixdep.c:156: warning: implicit declaration of function ‘realloc’
scripts/basic/fixdep.c:156: warning: assignment makes pointer from integer without a cast
scripts/basic/fixdep.c:158: warning: implicit declaration of function ‘perror’
scripts/basic/fixdep.c:158: warning: incompatible implicit declaration of built-in function ‘exit’
scripts/basic/fixdep.c: In function ‘is_defined_config’:
scripts/basic/fixdep.c:174: warning: implicit declaration of function ‘memcmp’
scripts/basic/fixdep.c: In function ‘define_config’:
scripts/basic/fixdep.c:187: warning: implicit declaration of function ‘memcpy’
scripts/basic/fixdep.c:187: warning: incompatible implicit declaration of built-in function ‘memcpy’
scripts/basic/fixdep.c: In function ‘use_config’:
scripts/basic/fixdep.c:206: error: ‘PATH_MAX’ undeclared (first use in this function)
scripts/basic/fixdep.c:214: warning: incompatible implicit declaration of built-in function ‘memcpy’
scripts/basic/fixdep.c:220: warning: implicit declaration of function ‘tolower’
scripts/basic/fixdep.c:222: warning: incompatible implicit declaration of built-in function ‘printf’
scripts/basic/fixdep.c:206: warning: unused variable ‘s’
scripts/basic/fixdep.c: At top level:
scripts/basic/fixdep.c:225: error: expected declaration specifiers or ‘...’ before ‘size_t’
scripts/basic/fixdep.c: In function ‘parse_config_file’:
scripts/basic/fixdep.c:227: error: ‘len’ undeclared (first use in this function)
scripts/basic/fixdep.c:233: warning: implicit declaration of function ‘ntohl’
scripts/basic/fixdep.c:244: warning: implicit declaration of function ‘isalnum’
scripts/basic/fixdep.c: In function ‘strrcmp’:
scripts/basic/fixdep.c:261: warning: implicit declaration of function ‘strlen’
scripts/basic/fixdep.c:261: warning: incompatible implicit declaration of built-in function ‘strlen’
scripts/basic/fixdep.c: In function ‘do_config_file’:
scripts/basic/fixdep.c:272: error: storage size of ‘st’ isn’t known
scripts/basic/fixdep.c:276: warning: implicit declaration of function ‘open’
scripts/basic/fixdep.c:276: error: ‘O_RDONLY’ undeclared (first use in this function)
scripts/basic/fixdep.c:278: warning: incompatible implicit declaration of built-in function ‘fprintf’
scripts/basic/fixdep.c:278: error: ‘stderr’ undeclared (first use in this function)
scripts/basic/fixdep.c:280: warning: incompatible implicit declaration of built-in function ‘exit’
scripts/basic/fixdep.c:282: warning: implicit declaration of function ‘fstat’
scripts/basic/fixdep.c:284: warning: implicit declaration of function ‘close’
scripts/basic/fixdep.c:287: warning: implicit declaration of function ‘mmap’
scripts/basic/fixdep.c:287: error: ‘PROT_READ’ undeclared (first use in this function)
scripts/basic/fixdep.c:287: error: ‘MAP_PRIVATE’ undeclared (first use in this function)
scripts/basic/fixdep.c:287: warning: assignment makes pointer from integer without a cast
scripts/basic/fixdep.c:294: error: too many arguments to function ‘parse_config_file’
scripts/basic/fixdep.c:296: warning: implicit declaration of function ‘munmap’
scripts/basic/fixdep.c:272: warning: unused variable ‘st’
scripts/basic/fixdep.c: At top level:
scripts/basic/fixdep.c:301: error: expected declaration specifiers or ‘...’ before ‘size_t’
scripts/basic/fixdep.c: In function ‘parse_dep_file’:
scripts/basic/fixdep.c:304: error: ‘len’ undeclared (first use in this function)
scripts/basic/fixdep.c:306: error: ‘PATH_MAX’ undeclared (first use in this function)
scripts/basic/fixdep.c:308: warning: implicit declaration of function ‘strchr’
scripts/basic/fixdep.c:308: warning: incompatible implicit declaration of built-in function ‘strchr’
scripts/basic/fixdep.c:310: warning: incompatible implicit declaration of built-in function ‘fprintf’
scripts/basic/fixdep.c:310: error: ‘stderr’ undeclared (first use in this function)
scripts/basic/fixdep.c:311: warning: incompatible implicit declaration of built-in function ‘exit’
scripts/basic/fixdep.c:313: warning: incompatible implicit declaration of built-in function ‘memcpy’
scripts/basic/fixdep.c:314: warning: incompatible implicit declaration of built-in function ‘printf’
scripts/basic/fixdep.c:306: warning: unused variable ‘s’
scripts/basic/fixdep.c: In function ‘print_deps’:
scripts/basic/fixdep.c:343: error: storage size of ‘st’ isn’t known
scripts/basic/fixdep.c:347: error: ‘O_RDONLY’ undeclared (first use in this function)
scripts/basic/fixdep.c:349: warning: incompatible implicit declaration of built-in function ‘fprintf’
scripts/basic/fixdep.c:349: error: ‘stderr’ undeclared (first use in this function)
scripts/basic/fixdep.c:351: warning: incompatible implicit declaration of built-in function ‘exit’
scripts/basic/fixdep.c:355: warning: incompatible implicit declaration of built-in function ‘fprintf’
scripts/basic/fixdep.c:359: error: ‘PROT_READ’ undeclared (first use in this function)
scripts/basic/fixdep.c:359: error: ‘MAP_PRIVATE’ undeclared (first use in this function)
scripts/basic/fixdep.c:359: warning: assignment makes pointer from integer without a cast
scripts/basic/fixdep.c:366: error: too many arguments to function ‘parse_dep_file’
scripts/basic/fixdep.c:343: warning: unused variable ‘st’
scripts/basic/fixdep.c: In function ‘traps’:
scripts/basic/fixdep.c:378: warning: incompatible implicit declaration of built-in function ‘fprintf’
scripts/basic/fixdep.c:378: error: ‘stderr’ undeclared (first use in this function)
scripts/basic/fixdep.c:380: warning: incompatible implicit declaration of built-in function ‘exit’
make[2]: *** [scripts/basic/fixdep] Error 1
make[1]: *** [scripts_basic] Error 2
make[1]: Leaving directory `/usr/src/linux-headers-2.6.24-16-generic'
make: *** [acerhk.ko] Error 2
回复

回到 “笔记本、UMPC支持”