安装arch后什么都弄好了,就是编译不了drcom,怎么办啊?

回复
170119566
帖子: 18
注册时间: 2009-10-05 22:09
送出感谢: 0
接收感谢: 0

安装arch后什么都弄好了,就是编译不了drcom,怎么办啊?

#1

帖子 170119566 » 2011-02-28 13:35

安装图形界面的时候出现的是这些错误,不过程序那还是有drcom的图标,但是不能用.
我的是64位的系统

代码: 全选

[leon@myhost drcom-pum-1.0]$ make & sudo make install
[1] 1919
make[1]: Entering directory `/home/leon/drcom-pum-1.0/src'
make[1]: Nothing to be done for `all'.
make[1]: Leaving directory `/home/leon/drcom-pum-1.0/src'
make[1]: Entering directory `/home/leon/drcom-pum-1.0/resource'
make[1]: Nothing to be done for `all'.
make[1]: Leaving directory `/home/leon/drcom-pum-1.0/resource'
make[1]: Entering directory `/home/leon/drcom-pum-1.0/src'
make[1]: Leaving directory `/home/leon/drcom-pum-1.0/src'
make[1]: Entering directory `/home/leon/drcom-pum-1.0/resource'
make[1]: Leaving directory `/home/leon/drcom-pum-1.0/resource'
:: Recompiling drcom kernel module.                                      [FAIL] 
make: *** [install] 错误 1
[1]+  Done                    make



而安装文字界面的时候是这些错误

代码: 全选

[root@myhost drcom-1.4.8.3]# make & make install
[1] 1987
make[1]: Entering directory `/home/leon/drcom-1.4.8.3/drcomc'
make[1]: Nothing to be done for `all'.
make[1]: Leaving directory `/home/leon/drcom-1.4.8.3/drcomc'
make[1]: Entering directory `/home/leon/drcom-1.4.8.3/drcomc'
make[1]: Entering directory `/home/leon/drcom-1.4.8.3/drcomd'
make[1]: Nothing to be done for `all'.
make[1]: Leaving directory `/home/leon/drcom-1.4.8.3/drcomd'
  INSTALL drcomc
make[1]: Leaving directory `/home/leon/drcom-1.4.8.3/drcomc'
make[1]: Entering directory `/home/leon/drcom-1.4.8.3/kmod'
make -C /lib/modules/2.6.37-ARCH/build M=/home/leon/drcom-1.4.8.3/kmod modules
make[1]: Entering directory `/home/leon/drcom-1.4.8.3/drcomd'
make: Entering an unknown directory
make: *** /lib/modules/2.6.37-ARCH/build: 没有那个文件或目录。 停止。
make: Leaving an unknown directory
  INSTALL drcomd
make[1]: *** [default] 错误 2
make[1]: Leaving directory `/home/leon/drcom-1.4.8.3/kmod'
make: *** [all] 错误 1
make[1]: Leaving directory `/home/leon/drcom-1.4.8.3/drcomd'
make[1]: Entering directory `/home/leon/drcom-1.4.8.3/kmod'
make -C /lib/modules/2.6.37-ARCH/build M=/home/leon/drcom-1.4.8.3/kmod modules_install
make: Entering an unknown directory
make: *** /lib/modules/2.6.37-ARCH/build: 没有那个文件或目录。 停止。
make: Leaving an unknown directory
make[1]: *** [install] 错误 2
make[1]: Leaving directory `/home/leon/drcom-1.4.8.3/kmod'
make: *** [install] 错误 1
[1]+  Exit 2                  make
[root@myhost drcom-1.4.8.3]# uname -a
Linux myhost 2.6.37-ARCH #1 SMP PREEMPT Fri Feb 18 18:32:16 CET 2011 x86_64 AMD Phenom(tm) II X3 710 Processor AuthenticAMD GNU/Linux
怎么办啊?? :em20 :em20 :em80 :em80 :em80
noso
帖子: 33
注册时间: 2010-10-28 14:48
送出感谢: 0
接收感谢: 0

Re: 安装arch后什么都弄好了,就是编译不了drcom,怎么办啊?

#2

帖子 noso » 2011-03-01 16:55

遇到相同的问题,帮顶一个 :em06
头像
wmpotato
帖子: 265
注册时间: 2009-11-06 19:48
送出感谢: 0
接收感谢: 0

Re: 安装arch后什么都弄好了,就是编译不了drcom,怎么办啊?

#3

帖子 wmpotato » 2011-03-01 17:06

你依赖全解决了吗? 要装linux-headers,libstdc++5 build-essential等,我门不同的发行版,也不知道arch对应的什么包...
http://hi.baidu.com/wmpotato

Debian~Debian~Debian~~~
jtshs256
论坛版主
帖子: 22323
注册时间: 2010-07-19 21:41
系统: OS X
送出感谢: 2 次
接收感谢: 27 次

Re: 安装arch后什么都弄好了,就是编译不了drcom,怎么办啊?

#4

帖子 jtshs256 » 2011-03-01 17:29

kernel26-headers?记不清了……
NO DO NO DIE
http://a/%%30%30
gwpuppy
帖子: 36
注册时间: 2011-04-02 19:53
送出感谢: 0
接收感谢: 0

Re: 安装arch后什么都弄好了,就是编译不了drcom,怎么办啊?

#5

帖子 gwpuppy » 2011-06-03 11:01

wmpotato 写了:你依赖全解决了吗? 要装linux-headers,libstdc++5 build-essential等,我门不同的发行版,也不知道arch对应的什么包...
没装drcom不能上网,linux-headers,libstdc++5 build-essential等在不上网情况能怎么装?
lvman2
帖子: 2
注册时间: 2010-08-31 10:17
送出感谢: 0
接收感谢: 0

Re: 安装arch后什么都弄好了,就是编译不了drcom,怎么办啊?

#6

帖子 lvman2 » 2011-06-03 22:07

我刚开始试了编译,N个版本都不行,前些天成功了,不记得哪个版本了,但是连接失败.然后试wine下安装也不行,最后利用wine运行我win7下安装好的ishareuser.exe文件,居然成功了......蛋疼.......
qq405165798
帖子: 79
注册时间: 2008-02-24 14:39
送出感谢: 0
接收感谢: 0

Re: 安装arch后什么都弄好了,就是编译不了drcom,怎么办啊?

#7

帖子 qq405165798 » 2011-07-01 10:22

170119566 写了:安装图形界面的时候出现的是这些错误,不过程序那还是有drcom的图标,但是不能用.
我的是64位的系统

代码: 全选

[leon@myhost drcom-pum-1.0]$ make & sudo make install
[1] 1919
make[1]: Entering directory `/home/leon/drcom-pum-1.0/src'
make[1]: Nothing to be done for `all'.
make[1]: Leaving directory `/home/leon/drcom-pum-1.0/src'
make[1]: Entering directory `/home/leon/drcom-pum-1.0/resource'
make[1]: Nothing to be done for `all'.
make[1]: Leaving directory `/home/leon/drcom-pum-1.0/resource'
make[1]: Entering directory `/home/leon/drcom-pum-1.0/src'
make[1]: Leaving directory `/home/leon/drcom-pum-1.0/src'
make[1]: Entering directory `/home/leon/drcom-pum-1.0/resource'
make[1]: Leaving directory `/home/leon/drcom-pum-1.0/resource'
:: Recompiling drcom kernel module.                                      [FAIL] 
make: *** [install] 错误 1
[1]+  Done                    make



而安装文字界面的时候是这些错误

代码: 全选

[root@myhost drcom-1.4.8.3]# make & make install
[1] 1987
make[1]: Entering directory `/home/leon/drcom-1.4.8.3/drcomc'
make[1]: Nothing to be done for `all'.
make[1]: Leaving directory `/home/leon/drcom-1.4.8.3/drcomc'
make[1]: Entering directory `/home/leon/drcom-1.4.8.3/drcomc'
make[1]: Entering directory `/home/leon/drcom-1.4.8.3/drcomd'
make[1]: Nothing to be done for `all'.
make[1]: Leaving directory `/home/leon/drcom-1.4.8.3/drcomd'
  INSTALL drcomc
make[1]: Leaving directory `/home/leon/drcom-1.4.8.3/drcomc'
make[1]: Entering directory `/home/leon/drcom-1.4.8.3/kmod'
make -C /lib/modules/2.6.37-ARCH/build M=/home/leon/drcom-1.4.8.3/kmod modules
make[1]: Entering directory `/home/leon/drcom-1.4.8.3/drcomd'
make: Entering an unknown directory
make: *** /lib/modules/2.6.37-ARCH/build: 没有那个文件或目录。 停止。
make: Leaving an unknown directory
  INSTALL drcomd
make[1]: *** [default] 错误 2
make[1]: Leaving directory `/home/leon/drcom-1.4.8.3/kmod'
make: *** [all] 错误 1
make[1]: Leaving directory `/home/leon/drcom-1.4.8.3/drcomd'
make[1]: Entering directory `/home/leon/drcom-1.4.8.3/kmod'
make -C /lib/modules/2.6.37-ARCH/build M=/home/leon/drcom-1.4.8.3/kmod modules_install
make: Entering an unknown directory
make: *** /lib/modules/2.6.37-ARCH/build: 没有那个文件或目录。 停止。
make: Leaving an unknown directory
make[1]: *** [install] 错误 2
make[1]: Leaving directory `/home/leon/drcom-1.4.8.3/kmod'
make: *** [install] 错误 1
[1]+  Exit 2                  make
[root@myhost drcom-1.4.8.3]# uname -a
Linux myhost 2.6.37-ARCH #1 SMP PREEMPT Fri Feb 18 18:32:16 CET 2011 x86_64 AMD Phenom(tm) II X3 710 Processor AuthenticAMD GNU/Linux
怎么办啊?? :em20 :em20 :em80 :em80 :em80
make & sudo make install改为
make && sudo make install
你的写法是,还没make完,就开始make install了
回复

回到 “Arch发行版”