[求助] MPICH3 的安装问题

回复
头像
Omegalpha
帖子: 19
注册时间: 2011-04-04 20:59
送出感谢: 0
接收感谢: 0

[求助] MPICH3 的安装问题

#1

帖子 Omegalpha » 2013-03-22 23:04

老是会有下面的错误提示,不明白是为什么。。。

代码: 全选

/home/omega/Downloads/mpich3/src/mpich-3.0.2/src/pm/hydra/tools/topo/hwloc/hwloc/include/private/cpuid.h: Assembler messages:
/home/omega/Downloads/mpich3/src/mpich-3.0.2/src/pm/hydra/tools/topo/hwloc/hwloc/include/private/cpuid.h:39: Error: symbol `Lhwloc1' is already defined
make[5]: *** [topology-x86.lo] Error 1
make[5]: Leaving directory `/home/omega/Downloads/mpich3/src/mpich-3.0.2/src/pm/hydra/tools/topo/hwloc/hwloc/src'
make[4]: *** [all-recursive] Error 1
make[4]: Leaving directory `/home/omega/Downloads/mpich3/src/mpich-3.0.2/src/pm/hydra/tools/topo/hwloc/hwloc/src'
make[3]: *** [all-recursive] Error 1
make[3]: Leaving directory `/home/omega/Downloads/mpich3/src/mpich-3.0.2/src/pm/hydra/tools/topo/hwloc/hwloc'
make[2]: *** [all-recursive] Error 1
make[2]: Leaving directory `/home/omega/Downloads/mpich3/src/mpich-3.0.2/src/pm/hydra'
make[1]: *** [all-recursive] Error 1
make[1]: Leaving directory `/home/omega/Downloads/mpich3/src/mpich-3.0.2'
make: *** [all] Error 2
==> ERROR: A failure occurred in build().
    Aborting...
尤其是这句

代码: 全选

symbol `Lhwloc1' is already defined
之前在x86_64上安装没有问题,换了i686就有这个错误,,,
Lenovo Y460 N卡
Bumblebee现在好用极啦
Ubuntu转到Arch啦!!
头像
Omegalpha
帖子: 19
注册时间: 2011-04-04 20:59
送出感谢: 0
接收感谢: 0

Re: [求助] MPICH3 的安装问题

#2

帖子 Omegalpha » 2013-03-23 18:24

怎么没有人回复啊
Lenovo Y460 N卡
Bumblebee现在好用极啦
Ubuntu转到Arch啦!!
回复

回到 “Arch发行版”