安装ROI PAC时出现的问题

Precise Pangolin (长期支持)
回复
186407a
帖子: 11
注册时间: 2016-11-16 21:16
系统: ubuntu
送出感谢: 1 次
接收感谢: 0

安装ROI PAC时出现的问题

#1

帖子 186407a » 2016-11-28 9:55

ROIPAC.png
一直报错不知道为什么
安装ROI-PAC make之后
make[2]: *** [roi] 错误 1
make[2]:正在离开目录 `/home/zhangyun/ROI_PAC_3_0_1/ROI_PAC/roi'
make[1]: *** [all-recursive] 错误 1
make[1]:正在离开目录 `/home/zhangyun/ROI_PAC_3_0_1/ROI_PAC'
make: *** [all] 错误 2

哪位能帮帮我 万分感谢
回复

回到 “Ubuntu 12.04 LTS”