当前时区为 UTC + 8 小时



发表新帖 回复这个主题  [ 1 篇帖子 ] 
作者 内容
1 楼 
 文章标题 : 安装tesseract-ocr文字识别软件的问题
帖子发表于 : 2009-09-04 20:04 

注册: 2008-09-19 3:26
帖子: 103
送出感谢: 0 次
接收感谢: 0 次
我用 svn checkout http://tesseract-ocr.googlecode.com/svn/trunk/ tesseract-ocr-read-only
下载了tesseract-ocr
然后 进入文件夹
./configure
之后make
但是出现下面错误
怎么办阿?
谢谢

make all-recursive
make[1]: Entering directory `/home/nanger/tesseract-ocr-read-only'
Making all in ccstruct
make[2]: Entering directory `/home/nanger/tesseract-ocr-read-only/ccstruct'
make[3]: Entering directory `/home/nanger/tesseract-ocr-read-only/ccstruct'
source='blobbox.cpp' object='blobbox.o' libtool=no \
DEPDIR=.deps depmode=none /bin/bash ../config/depcomp \
g++ -DHAVE_CONFIG_H -I. -I.. -I../ccutil -I../cutil -I../image -I../viewer -g -O2 -c -o blobbox.o blobbox.cpp
/bin/bash: ../config/depcomp: No such file or directory
make[3]: *** [blobbox.o] Error 127
make[3]: Leaving directory `/home/nanger/tesseract-ocr-read-only/ccstruct'
make[2]: *** [all-recursive] Error 1
make[2]: Leaving directory `/home/nanger/tesseract-ocr-read-only/ccstruct'
make[1]: *** [all-recursive] Error 1
make[1]: Leaving directory `/home/nanger/tesseract-ocr-read-only'
make: *** [all] Error 2


页首
 用户资料  
 
显示帖子 :  排序  
发表新帖 回复这个主题  [ 1 篇帖子 ] 

当前时区为 UTC + 8 小时


在线用户

正在浏览此版面的用户:没有注册用户 和 5 位游客


不能 在这个版面发表主题
不能 在这个版面回复主题
不能 在这个版面编辑帖子
不能 在这个版面删除帖子
不能 在这个版面提交附件

前往 :  
本站点为公益性站点,用于推广开源自由软件,由 DiaHosting VPSBudgetVM VPS 提供服务。
我们认为:软件应可免费取得,软件工具在各种语言环境下皆可使用,且不会有任何功能上的差异;
人们应有定制和修改软件的自由,且方式不受限制,只要他们自认为合适。

Powered by phpBB © 2000, 2002, 2005, 2007 phpBB Group
简体中文语系由 王笑宇 翻译