当前时区为 UTC + 8 小时



发表新帖 回复这个主题  [ 5 篇帖子 ] 
作者 内容
1 楼 
 文章标题 : com口工具minicom安装出错
帖子发表于 : 2009-11-01 14:15 

注册: 2008-11-17 12:46
帖子: 5
送出感谢: 0 次
接收感谢: 0 次
直接安装DEB包没有问题
现用源码安装 可是怎样都安不上去

config.log

This file contains any messages produced by compilers while
running configure, to aid debugging if configure makes a mistake.

It was created by minicom configure 2.2, which was
generated by GNU Autoconf 2.59. Invocation command line was

$ ./configure

## --------- ##
## Platform. ##
## --------- ##

hostname = ubuntu
uname -m = i686
uname -r = 2.6.28-11-generic
uname -s = Linux
uname -v = #42-Ubuntu SMP Fri Apr 17 01:57:59 UTC 2009

/usr/bin/uname -p = unknown
/bin/uname -X = unknown

/bin/arch = unknown
/usr/bin/arch -k = unknown
/usr/convex/getsysinfo = unknown
hostinfo = unknown
/bin/machine = unknown
/usr/bin/oslevel = unknown
/bin/universe = unknown

PATH: /usr/local/sbin
PATH: /usr/local/bin
PATH: /usr/sbin
PATH: /usr/bin
PATH: /sbin
PATH: /bin
PATH: /usr/X11R6/bin


## ----------- ##
## Core tests. ##
## ----------- ##

configure:1386: checking for a BSD-compatible install
configure:1441: result: /usr/bin/install -c
configure:1452: checking whether build environment is sane
configure:1495: result: yes
configure:1560: checking for gawk
configure:1589: result: no
configure:1560: checking for mawk
configure:1576: found /usr/bin/mawk
configure:1586: result: mawk
configure:1596: checking whether make sets $(MAKE)
configure:1616: result: yes
configure:1831: checking for gcc
configure:1847: found /usr/bin/gcc
configure:1857: result: gcc
configure:2101: checking for C compiler version
configure:2104: gcc --version </dev/null >&5
gcc (Ubuntu 4.3.3-5ubuntu4) 4.3.3
Copyright (C) 2008 Free Software Foundation, Inc.
This is free software; see the source for copying conditions. There is NO
warranty; not even for MERCHANTABILITY or FITNESS FOR A PARTICULAR PURPOSE.

configure:2107: $? = 0
configure:2109: gcc -v </dev/null >&5
Using built-in specs.
Target: i486-linux-gnu
Configured with: ../src/configure -v --with-pkgversion='Ubuntu 4.3.3-5ubuntu4' --with-bugurl=file:///usr/share/doc/gcc-4.3/README.Bugs --enable-languages=c,c++,fortran,objc,obj-c++ --prefix=/usr --enable-shared --with-system-zlib --libexecdir=/usr/lib --without-included-gettext --enable-threads=posix --enable-nls --with-gxx-include-dir=/usr/include/c++/4.3 --program-suffix=-4.3 --enable-clocale=gnu --enable-libstdcxx-debug --enable-objc-gc --enable-mpfr --enable-targets=all --with-tune=generic --enable-checking=release --build=i486-linux-gnu --host=i486-linux-gnu --target=i486-linux-gnu
Thread model: posix
gcc version 4.3.3 (Ubuntu 4.3.3-5ubuntu4)
configure:2112: $? = 0
configure:2114: gcc -V </dev/null >&5
gcc: '-V' option must have argument
configure:2117: $? = 1
configure:2140: checking for C compiler default output file name
configure:2143: gcc conftest.c >&5
configure:2146: $? = 0
configure:2192: result: a.out
configure:2197: checking whether the C compiler works
configure:2203: ./a.out
configure:2206: $? = 0
configure:2223: result: yes
configure:2230: checking whether we are cross compiling
configure:2232: result: no
configure:2235: checking for suffix of executables
configure:2237: gcc -o conftest conftest.c >&5
configure:2240: $? = 0
configure:2265: result:
configure:2271: checking for suffix of object files
configure:2292: gcc -c conftest.c >&5
configure:2295: $? = 0
configure:2317: result: o
configure:2321: checking whether we are using the GNU C compiler
configure:2345: gcc -c conftest.c >&5
configure:2351: $? = 0
configure:2354: test -z || test ! -s conftest.err
configure:2357: $? = 0
configure:2360: test -s conftest.o
configure:2363: $? = 0
configure:2376: result: yes
configure:2382: checking whether gcc accepts -g
configure:2403: gcc -c -g conftest.c >&5
configure:2409: $? = 0
configure:2412: test -z || test ! -s conftest.err
configure:2415: $? = 0
configure:2418: test -s conftest.o
configure:2421: $? = 0
configure:2432: result: yes
configure:2449: checking for gcc option to accept ANSI C
configure:2519: gcc -c -g -O2 conftest.c >&5
configure:2525: $? = 0
configure:2528: test -z || test ! -s conftest.err
configure:2531: $? = 0
configure:2534: test -s conftest.o
configure:2537: $? = 0
configure:2555: result: none needed
configure:2573: gcc -c -g -O2 conftest.c >&5
conftest.c:2: error: expected '=', ',', ';', 'asm' or '__attribute__' before 'me'
configure:2579: $? = 1
configure: failed program was:
| #ifndef __cplusplus
| choke me
| #endif
configure:2720: checking for style of include used by make
configure:2748: result: GNU
configure:2776: checking dependency style of gcc
configure:2866: result: gcc3
configure:2890: checking how to run the C preprocessor
configure:2925: gcc -E conftest.c
configure:2931: $? = 0
configure:2963: gcc -E conftest.c
conftest.c:11:28: error: ac_nonexistent.h: No such file or directory
configure:2969: $? = 1
configure: failed program was:
| /* confdefs.h. */
|
| #define PACKAGE_NAME "minicom"
| #define PACKAGE_TARNAME "minicom"
| #define PACKAGE_VERSION "2.2"
| #define PACKAGE_STRING "minicom 2.2"
| #define PACKAGE_BUGREPORT "minicom-devel@lists.alioth.debian.org"
| #define PACKAGE "minicom"
| #define VERSION "2.2"
| /* end confdefs.h. */
| #include <ac_nonexistent.h>
configure:3008: result: gcc -E
configure:3032: gcc -E conftest.c
configure:3038: $? = 0
configure:3070: gcc -E conftest.c
conftest.c:11:28: error: ac_nonexistent.h: No such file or directory
configure:3076: $? = 1
configure: failed program was:
| /* confdefs.h. */
|
| #define PACKAGE_NAME "minicom"
| #define PACKAGE_TARNAME "minicom"
| #define PACKAGE_VERSION "2.2"
| #define PACKAGE_STRING "minicom 2.2"
| #define PACKAGE_BUGREPORT "minicom-devel@lists.alioth.debian.org"
| #define PACKAGE "minicom"
| #define VERSION "2.2"
| /* end confdefs.h. */
| #include <ac_nonexistent.h>
configure:3120: checking for egrep
configure:3130: result: grep -E
configure:3136: checking for AIX
configure:3158: result: no
configure:3164: checking for ANSI C header files
configure:3189: gcc -c -g -O2 conftest.c >&5
configure:3195: $? = 0
configure:3198: test -z || test ! -s conftest.err
configure:3201: $? = 0
configure:3204: test -s conftest.o
configure:3207: $? = 0
configure:3296: gcc -o conftest -g -O2 conftest.c >&5
conftest.c: In function 'main':
conftest.c:28: warning: incompatible implicit declaration of built-in function 'exit'
configure:3299: $? = 0
configure:3301: ./conftest
configure:3304: $? = 0
configure:3319: result: yes
configure:3343: checking for sys/types.h
configure:3359: gcc -c -g -O2 conftest.c >&5
configure:3365: $? = 0
configure:3368: test -z || test ! -s conftest.err
configure:3371: $? = 0
configure:3374: test -s conftest.o
configure:3377: $? = 0
configure:3388: result: yes
configure:3343: checking for sys/stat.h
configure:3359: gcc -c -g -O2 conftest.c >&5
configure:3365: $? = 0
configure:3368: test -z || test ! -s conftest.err
configure:3371: $? = 0
configure:3374: test -s conftest.o
configure:3377: $? = 0
configure:3388: result: yes
configure:3343: checking for stdlib.h
configure:3359: gcc -c -g -O2 conftest.c >&5
configure:3365: $? = 0
configure:3368: test -z || test ! -s conftest.err
configure:3371: $? = 0
configure:3374: test -s conftest.o
configure:3377: $? = 0
configure:3388: result: yes
configure:3343: checking for string.h
configure:3359: gcc -c -g -O2 conftest.c >&5
configure:3365: $? = 0
configure:3368: test -z || test ! -s conftest.err
configure:3371: $? = 0
configure:3374: test -s conftest.o
configure:3377: $? = 0
configure:3388: result: yes
configure:3343: checking for memory.h
configure:3359: gcc -c -g -O2 conftest.c >&5
configure:3365: $? = 0
configure:3368: test -z || test ! -s conftest.err
configure:3371: $? = 0
configure:3374: test -s conftest.o
configure:3377: $? = 0
configure:3388: result: yes
configure:3343: checking for strings.h
configure:3359: gcc -c -g -O2 conftest.c >&5
configure:3365: $? = 0
configure:3368: test -z || test ! -s conftest.err
configure:3371: $? = 0
configure:3374: test -s conftest.o
configure:3377: $? = 0
configure:3388: result: yes
configure:3343: checking for inttypes.h
configure:3359: gcc -c -g -O2 conftest.c >&5
configure:3365: $? = 0
configure:3368: test -z || test ! -s conftest.err
configure:3371: $? = 0
configure:3374: test -s conftest.o
configure:3377: $? = 0
configure:3388: result: yes
configure:3343: checking for stdint.h
configure:3359: gcc -c -g -O2 conftest.c >&5
configure:3365: $? = 0
configure:3368: test -z || test ! -s conftest.err
configure:3371: $? = 0
configure:3374: test -s conftest.o
configure:3377: $? = 0
configure:3388: result: yes
configure:3343: checking for unistd.h
configure:3359: gcc -c -g -O2 conftest.c >&5
configure:3365: $? = 0
configure:3368: test -z || test ! -s conftest.err
configure:3371: $? = 0
configure:3374: test -s conftest.o
configure:3377: $? = 0
configure:3388: result: yes
configure:3410: checking minix/config.h usability
configure:3422: gcc -c -g -O2 conftest.c >&5
conftest.c:55:26: error: minix/config.h: No such file or directory
configure:3428: $? = 1
configure: failed program was:
| /* confdefs.h. */
|
| #define PACKAGE_NAME "minicom"
| #define PACKAGE_TARNAME "minicom"
| #define PACKAGE_VERSION "2.2"
| #define PACKAGE_STRING "minicom 2.2"
| #define PACKAGE_BUGREPORT "minicom-devel@lists.alioth.debian.org"
| #define PACKAGE "minicom"
| #define VERSION "2.2"
| #define STDC_HEADERS 1
| #define HAVE_SYS_TYPES_H 1
| #define HAVE_SYS_STAT_H 1
| #define HAVE_STDLIB_H 1
| #define HAVE_STRING_H 1
| #define HAVE_MEMORY_H 1
| #define HAVE_STRINGS_H 1
| #define HAVE_INTTYPES_H 1
| #define HAVE_STDINT_H 1
| #define HAVE_UNISTD_H 1
| /* end confdefs.h. */
| #include <stdio.h>
| #if HAVE_SYS_TYPES_H
| # include <sys/types.h>
| #endif
| #if HAVE_SYS_STAT_H
| # include <sys/stat.h>
| #endif
| #if STDC_HEADERS
| # include <stdlib.h>
| # include <stddef.h>
| #else
| # if HAVE_STDLIB_H
| # include <stdlib.h>
| # endif
| #endif
| #if HAVE_STRING_H
| # if !STDC_HEADERS && HAVE_MEMORY_H
| # include <memory.h>
| # endif
| # include <string.h>
| #endif
| #if HAVE_STRINGS_H
| # include <strings.h>
| #endif
| #if HAVE_INTTYPES_H
| # include <inttypes.h>
| #else
| # if HAVE_STDINT_H
| # include <stdint.h>
| # endif
| #endif
| #if HAVE_UNISTD_H
| # include <unistd.h>
| #endif
| #include <minix/config.h>
configure:3450: result: no
configure:3454: checking minix/config.h presence
configure:3464: gcc -E conftest.c
conftest.c:21:26: error: minix/config.h: No such file or directory
configure:3470: $? = 1
configure: failed program was:
| /* confdefs.h. */
|
| #define PACKAGE_NAME "minicom"
| #define PACKAGE_TARNAME "minicom"
| #define PACKAGE_VERSION "2.2"
| #define PACKAGE_STRING "minicom 2.2"
| #define PACKAGE_BUGREPORT "minicom-devel@lists.alioth.debian.org"
| #define PACKAGE "minicom"
| #define VERSION "2.2"
| #define STDC_HEADERS 1
| #define HAVE_SYS_TYPES_H 1
| #define HAVE_SYS_STAT_H 1
| #define HAVE_STDLIB_H 1
| #define HAVE_STRING_H 1
| #define HAVE_MEMORY_H 1
| #define HAVE_STRINGS_H 1
| #define HAVE_INTTYPES_H 1
| #define HAVE_STDINT_H 1
| #define HAVE_UNISTD_H 1
| /* end confdefs.h. */
| #include <minix/config.h>
configure:3490: result: no
configure:3525: checking for minix/config.h
configure:3532: result: no
configure:3575: checking for a BSD-compatible install
configure:3630: result: /usr/bin/install -c
configure:3682: checking for ranlib
configure:3698: found /usr/bin/ranlib
configure:3709: result: ranlib
configure:3722: checking for library containing strerror
configure:3752: gcc -o conftest -g -O2 conftest.c >&5
configure:3758: $? = 0
configure:3761: test -z || test ! -s conftest.err
configure:3764: $? = 0
configure:3767: test -s conftest
configure:3770: $? = 0
configure:3839: result: none required
configure:4014: checking whether NLS is requested
configure:4023: result: yes
configure:4061: checking for msgfmt
configure: trying /usr/bin/msgfmt...
0 translated messages.
configure:4093: result: /usr/bin/msgfmt
configure:4102: checking for gmsgfmt
configure:4133: result: /usr/bin/msgfmt
configure:4172: checking for xgettext
configure: trying /usr/bin/xgettext...
/usr/bin/xgettext: warning: file `/dev/null' extension `' is unknown; will try C
configure:4204: result: /usr/bin/xgettext
configure:4244: checking for msgmerge
configure: trying /usr/bin/msgmerge...
configure:4275: result: /usr/bin/msgmerge
configure:4332: checking build system type
configure:4350: result: i686-pc-linux-gnu
configure:4358: checking host system type
configure:4372: result: i686-pc-linux-gnu
configure:4404: checking for ld used by GCC
configure:4468: result: /usr/bin/ld
configure:4477: checking if the linker (/usr/bin/ld) is GNU ld
configure:4490: result: yes
configure:4497: checking for shared library run path origin
configure:4510: result: done
configure:4926: checking for CFPreferencesCopyAppValue
configure:4951: gcc -o conftest -g -O2 -I/System/Library/Frameworks/CoreFoundation.framework/Headers conftest.c -framework CoreFoundation >&5
gcc: CoreFoundation: No such file or directory
cc1: error: unrecognized command line option "-framework"
configure:4957: $? = 1
configure: failed program was:
| /* confdefs.h. */
|
| #define PACKAGE_NAME "minicom"
| #define PACKAGE_TARNAME "minicom"
| #define PACKAGE_VERSION "2.2"
| #define PACKAGE_STRING "minicom 2.2"
| #define PACKAGE_BUGREPORT "minicom-devel@lists.alioth.debian.org"
| #define PACKAGE "minicom"
| #define VERSION "2.2"
| #define STDC_HEADERS 1
| #define HAVE_SYS_TYPES_H 1
| #define HAVE_SYS_STAT_H 1
| #define HAVE_STDLIB_H 1
| #define HAVE_STRING_H 1
| #define HAVE_MEMORY_H 1
| #define HAVE_STRINGS_H 1
| #define HAVE_INTTYPES_H 1
| #define HAVE_STDINT_H 1
| #define HAVE_UNISTD_H 1
| #define USE_SOCKET 1
| /* end confdefs.h. */
| #include <CFPreferences.h>
| int
| main ()
| {
| CFPreferencesCopyAppValue(NULL, NULL)
| ;
| return 0;
| }
configure:4983: result: no
configure:4992: checking for CFLocaleCopyCurrent
configure:5017: gcc -o conftest -g -O2 -I/System/Library/Frameworks/CoreFoundation.framework/Headers conftest.c -framework CoreFoundation >&5
gcc: CoreFoundation: No such file or directory
cc1: error: unrecognized command line option "-framework"
configure:5023: $? = 1
configure: failed program was:
| /* confdefs.h. */
|
| #define PACKAGE_NAME "minicom"
| #define PACKAGE_TARNAME "minicom"
| #define PACKAGE_VERSION "2.2"
| #define PACKAGE_STRING "minicom 2.2"
| #define PACKAGE_BUGREPORT "minicom-devel@lists.alioth.debian.org"
| #define PACKAGE "minicom"
| #define VERSION "2.2"
| #define STDC_HEADERS 1
| #define HAVE_SYS_TYPES_H 1
| #define HAVE_SYS_STAT_H 1
| #define HAVE_STDLIB_H 1
| #define HAVE_STRING_H 1
| #define HAVE_MEMORY_H 1
| #define HAVE_STRINGS_H 1
| #define HAVE_INTTYPES_H 1
| #define HAVE_STDINT_H 1
| #define HAVE_UNISTD_H 1
| #define USE_SOCKET 1
| /* end confdefs.h. */
| #include <CFLocale.h>
| int
| main ()
| {
| CFLocaleCopyCurrent();
| ;
| return 0;
| }
configure:5049: result: no
configure:5066: checking whether NLS is requested
configure:5075: result: yes
configure:5093: checking for GNU gettext in libc
configure:5117: gcc -o conftest -g -O2 conftest.c >&5
configure:5123: $? = 0
configure:5126: test -z || test ! -s conftest.err
configure:5129: $? = 0
configure:5132: test -s conftest
configure:5135: $? = 0
configure:5147: result: yes
configure:5850: checking whether to use NLS
configure:5852: result: yes
configure:5855: checking where the gettext function comes from
configure:5866: result: libc
configure:5933: checking for kermit
configure:5965: result: no
configure:5999: checking for tputs in -ltinfo
configure:6029: gcc -o conftest -g -O2 conftest.c -ltinfo >&5
/usr/bin/ld: cannot find -ltinfo
collect2: ld returned 1 exit status
configure:6035: $? = 1
configure: failed program was:
| /* confdefs.h. */
|
| #define PACKAGE_NAME "minicom"
| #define PACKAGE_TARNAME "minicom"
| #define PACKAGE_VERSION "2.2"
| #define PACKAGE_STRING "minicom 2.2"
| #define PACKAGE_BUGREPORT "minicom-devel@lists.alioth.debian.org"
| #define PACKAGE "minicom"
| #define VERSION "2.2"
| #define STDC_HEADERS 1
| #define HAVE_SYS_TYPES_H 1
| #define HAVE_SYS_STAT_H 1
| #define HAVE_STDLIB_H 1
| #define HAVE_STRING_H 1
| #define HAVE_MEMORY_H 1
| #define HAVE_STRINGS_H 1
| #define HAVE_INTTYPES_H 1
| #define HAVE_STDINT_H 1
| #define HAVE_UNISTD_H 1
| #define USE_SOCKET 1
| #define ENABLE_NLS 1
| #define HAVE_GETTEXT 1
| #define HAVE_DCGETTEXT 1
| #define KERMIT ""
| /* end confdefs.h. */
|
| /* Override any gcc2 internal prototype to avoid an error. */
| #ifdef __cplusplus
| extern "C"
| #endif
| /* We use char because int might match the return type of a gcc2
| builtin and then its argument prototype would still apply. */
| char tputs ();
| int
| main ()
| {
| tputs ();
| ;
| return 0;
| }
configure:6060: result: no
configure:5999: checking for tputs in -lncurses
configure:6029: gcc -o conftest -g -O2 conftest.c -lncurses >&5
/usr/bin/ld: cannot find -lncurses
collect2: ld returned 1 exit status
configure:6035: $? = 1
configure: failed program was:
| /* confdefs.h. */
|
| #define PACKAGE_NAME "minicom"
| #define PACKAGE_TARNAME "minicom"
| #define PACKAGE_VERSION "2.2"
| #define PACKAGE_STRING "minicom 2.2"
| #define PACKAGE_BUGREPORT "minicom-devel@lists.alioth.debian.org"
| #define PACKAGE "minicom"
| #define VERSION "2.2"
| #define STDC_HEADERS 1
| #define HAVE_SYS_TYPES_H 1
| #define HAVE_SYS_STAT_H 1
| #define HAVE_STDLIB_H 1
| #define HAVE_STRING_H 1
| #define HAVE_MEMORY_H 1
| #define HAVE_STRINGS_H 1
| #define HAVE_INTTYPES_H 1
| #define HAVE_STDINT_H 1
| #define HAVE_UNISTD_H 1
| #define USE_SOCKET 1
| #define ENABLE_NLS 1
| #define HAVE_GETTEXT 1
| #define HAVE_DCGETTEXT 1
| #define KERMIT ""
| /* end confdefs.h. */
|
| /* Override any gcc2 internal prototype to avoid an error. */
| #ifdef __cplusplus
| extern "C"
| #endif
| /* We use char because int might match the return type of a gcc2
| builtin and then its argument prototype would still apply. */
| char tputs ();
| int
| main ()
| {
| tputs ();
| ;
| return 0;
| }
configure:6060: result: no
configure:5999: checking for tputs in -lcurses
configure:6029: gcc -o conftest -g -O2 conftest.c -lcurses >&5
/usr/bin/ld: cannot find -lcurses
collect2: ld returned 1 exit status
configure:6035: $? = 1
configure: failed program was:
| /* confdefs.h. */
|
| #define PACKAGE_NAME "minicom"
| #define PACKAGE_TARNAME "minicom"
| #define PACKAGE_VERSION "2.2"
| #define PACKAGE_STRING "minicom 2.2"
| #define PACKAGE_BUGREPORT "minicom-devel@lists.alioth.debian.org"
| #define PACKAGE "minicom"
| #define VERSION "2.2"
| #define STDC_HEADERS 1
| #define HAVE_SYS_TYPES_H 1
| #define HAVE_SYS_STAT_H 1
| #define HAVE_STDLIB_H 1
| #define HAVE_STRING_H 1
| #define HAVE_MEMORY_H 1
| #define HAVE_STRINGS_H 1
| #define HAVE_INTTYPES_H 1
| #define HAVE_STDINT_H 1
| #define HAVE_UNISTD_H 1
| #define USE_SOCKET 1
| #define ENABLE_NLS 1
| #define HAVE_GETTEXT 1
| #define HAVE_DCGETTEXT 1
| #define KERMIT ""
| /* end confdefs.h. */
|
| /* Override any gcc2 internal prototype to avoid an error. */
| #ifdef __cplusplus
| extern "C"
| #endif
| /* We use char because int might match the return type of a gcc2
| builtin and then its argument prototype would still apply. */
| char tputs ();
| int
| main ()
| {
| tputs ();
| ;
| return 0;
| }
configure:6060: result: no
configure:5999: checking for tputs in -ltermcap
configure:6029: gcc -o conftest -g -O2 conftest.c -ltermcap >&5
/usr/bin/ld: cannot find -ltermcap
collect2: ld returned 1 exit status
configure:6035: $? = 1
configure: failed program was:
| /* confdefs.h. */
|
| #define PACKAGE_NAME "minicom"
| #define PACKAGE_TARNAME "minicom"
| #define PACKAGE_VERSION "2.2"
| #define PACKAGE_STRING "minicom 2.2"
| #define PACKAGE_BUGREPORT "minicom-devel@lists.alioth.debian.org"
| #define PACKAGE "minicom"
| #define VERSION "2.2"
| #define STDC_HEADERS 1
| #define HAVE_SYS_TYPES_H 1
| #define HAVE_SYS_STAT_H 1
| #define HAVE_STDLIB_H 1
| #define HAVE_STRING_H 1
| #define HAVE_MEMORY_H 1
| #define HAVE_STRINGS_H 1
| #define HAVE_INTTYPES_H 1
| #define HAVE_STDINT_H 1
| #define HAVE_UNISTD_H 1
| #define USE_SOCKET 1
| #define ENABLE_NLS 1
| #define HAVE_GETTEXT 1
| #define HAVE_DCGETTEXT 1
| #define KERMIT ""
| /* end confdefs.h. */
|
| /* Override any gcc2 internal prototype to avoid an error. */
| #ifdef __cplusplus
| extern "C"
| #endif
| /* We use char because int might match the return type of a gcc2
| builtin and then its argument prototype would still apply. */
| char tputs ();
| int
| main ()
| {
| tputs ();
| ;
| return 0;
| }
configure:6060: result: no
configure:5999: checking for tputs in -lterminfo
configure:6029: gcc -o conftest -g -O2 conftest.c -lterminfo >&5
/usr/bin/ld: cannot find -lterminfo
collect2: ld returned 1 exit status
configure:6035: $? = 1
configure: failed program was:
| /* confdefs.h. */
|
| #define PACKAGE_NAME "minicom"
| #define PACKAGE_TARNAME "minicom"
| #define PACKAGE_VERSION "2.2"
| #define PACKAGE_STRING "minicom 2.2"
| #define PACKAGE_BUGREPORT "minicom-devel@lists.alioth.debian.org"
| #define PACKAGE "minicom"
| #define VERSION "2.2"
| #define STDC_HEADERS 1
| #define HAVE_SYS_TYPES_H 1
| #define HAVE_SYS_STAT_H 1
| #define HAVE_STDLIB_H 1
| #define HAVE_STRING_H 1
| #define HAVE_MEMORY_H 1
| #define HAVE_STRINGS_H 1
| #define HAVE_INTTYPES_H 1
| #define HAVE_STDINT_H 1
| #define HAVE_UNISTD_H 1
| #define USE_SOCKET 1
| #define ENABLE_NLS 1
| #define HAVE_GETTEXT 1
| #define HAVE_DCGETTEXT 1
| #define KERMIT ""
| /* end confdefs.h. */
|
| /* Override any gcc2 internal prototype to avoid an error. */
| #ifdef __cplusplus
| extern "C"
| #endif
| /* We use char because int might match the return type of a gcc2
| builtin and then its argument prototype would still apply. */
| char tputs ();
| int
| main ()
| {
| tputs ();
| ;
| return 0;
| }
configure:6060: result: no
configure:5999: checking for tputs in -ltermlib
configure:6029: gcc -o conftest -g -O2 conftest.c -ltermlib >&5
/usr/bin/ld: cannot find -ltermlib
collect2: ld returned 1 exit status
configure:6035: $? = 1
configure: failed program was:
| /* confdefs.h. */
|
| #define PACKAGE_NAME "minicom"
| #define PACKAGE_TARNAME "minicom"
| #define PACKAGE_VERSION "2.2"
| #define PACKAGE_STRING "minicom 2.2"
| #define PACKAGE_BUGREPORT "minicom-devel@lists.alioth.debian.org"
| #define PACKAGE "minicom"
| #define VERSION "2.2"
| #define STDC_HEADERS 1
| #define HAVE_SYS_TYPES_H 1
| #define HAVE_SYS_STAT_H 1
| #define HAVE_STDLIB_H 1
| #define HAVE_STRING_H 1
| #define HAVE_MEMORY_H 1
| #define HAVE_STRINGS_H 1
| #define HAVE_INTTYPES_H 1
| #define HAVE_STDINT_H 1
| #define HAVE_UNISTD_H 1
| #define USE_SOCKET 1
| #define ENABLE_NLS 1
| #define HAVE_GETTEXT 1
| #define HAVE_DCGETTEXT 1
| #define KERMIT ""
| /* end confdefs.h. */
|
| /* Override any gcc2 internal prototype to avoid an error. */
| #ifdef __cplusplus
| extern "C"
| #endif
| /* We use char because int might match the return type of a gcc2
| builtin and then its argument prototype would still apply. */
| char tputs ();
| int
| main ()
| {
| tputs ();
| ;
| return 0;
| }
configure:6060: result: no
configure:6223: checking for socket in -lsocket
configure:6253: gcc -o conftest -g -O2 conftest.c -lsocket >&5
/usr/bin/ld: cannot find -lsocket
collect2: ld returned 1 exit status
configure:6259: $? = 1
configure: failed program was:
| /* confdefs.h. */
|
| #define PACKAGE_NAME "minicom"
| #define PACKAGE_TARNAME "minicom"
| #define PACKAGE_VERSION "2.2"
| #define PACKAGE_STRING "minicom 2.2"
| #define PACKAGE_BUGREPORT "minicom-devel@lists.alioth.debian.org"
| #define PACKAGE "minicom"
| #define VERSION "2.2"
| #define STDC_HEADERS 1
| #define HAVE_SYS_TYPES_H 1
| #define HAVE_SYS_STAT_H 1
| #define HAVE_STDLIB_H 1
| #define HAVE_STRING_H 1
| #define HAVE_MEMORY_H 1
| #define HAVE_STRINGS_H 1
| #define HAVE_INTTYPES_H 1
| #define HAVE_STDINT_H 1
| #define HAVE_UNISTD_H 1
| #define USE_SOCKET 1
| #define ENABLE_NLS 1
| #define HAVE_GETTEXT 1
| #define HAVE_DCGETTEXT 1
| #define KERMIT ""
| /* end confdefs.h. */
|
| /* Override any gcc2 internal prototype to avoid an error. */
| #ifdef __cplusplus
| extern "C"
| #endif
| /* We use char because int might match the return type of a gcc2
| builtin and then its argument prototype would still apply. */
| char socket ();
| int
| main ()
| {
| socket ();
| ;
| return 0;
| }
configure:6284: result: no
configure:6304: checking for dirent.h that defines DIR
configure:6328: gcc -c -g -O2 conftest.c >&5
configure:6334: $? = 0
configure:6337: test -z || test ! -s conftest.err
configure:6340: $? = 0
configure:6343: test -s conftest.o
configure:6346: $? = 0
configure:6357: result: yes
configure:6370: checking for library containing opendir
configure:6400: gcc -o conftest -g -O2 conftest.c >&5
configure:6406: $? = 0
configure:6409: test -z || test ! -s conftest.err
configure:6412: $? = 0
configure:6415: test -s conftest
configure:6418: $? = 0
configure:6487: result: none required
configure:6621: checking for ANSI C header files
configure:6776: result: yes
configure:6786: checking for sys/wait.h that is POSIX.1 compatible
configure:6817: gcc -c -g -O2 conftest.c >&5
configure:6823: $? = 0
configure:6826: test -z || test ! -s conftest.err
configure:6829: $? = 0
configure:6832: test -s conftest.o
configure:6835: $? = 0
configure:6846: result: yes
configure:6856: checking whether stat file-mode macros are broken
configure:6904: result: no
configure:6914: checking whether time.h and sys/time.h may both be included
configure:6939: gcc -c -g -O2 conftest.c >&5
configure:6945: $? = 0
configure:6948: test -z || test ! -s conftest.err
configure:6951: $? = 0
configure:6954: test -s conftest.o
configure:6957: $? = 0
configure:6968: result: yes
configure:6979: checking POSIX termios
configure:7004: gcc -o conftest -g -O2 conftest.c >&5
configure:7010: $? = 0
configure:7013: test -z || test ! -s conftest.err
configure:7016: $? = 0
configure:7019: test -s conftest
configure:7022: $? = 0
configure:7034: result: yes
configure:7037: checking whether termios.h defines TIOCGWINSZ
configure:7064: result: no
configure:7068: checking whether sys/ioctl.h defines TIOCGWINSZ
configure:7095: result: yes
configure:7154: checking stdarg.h usability
configure:7166: gcc -c -g -O2 conftest.c >&5
configure:7172: $? = 0
configure:7175: test -z || test ! -s conftest.err
configure:7178: $? = 0
configure:7181: test -s conftest.o
configure:7184: $? = 0
configure:7194: result: yes
configure:7198: checking stdarg.h presence
configure:7208: gcc -E conftest.c
configure:7214: $? = 0
configure:7234: result: yes
configure:7269: checking for stdarg.h
configure:7276: result: yes
configure:7154: checking varargs.h usability
configure:7166: gcc -c -g -O2 conftest.c >&5
In file included from conftest.c:67:
/usr/lib/gcc/i486-linux-gnu/4.3.3/include/varargs.h:4:2: error: #error "GCC no longer implements <varargs.h>."
/usr/lib/gcc/i486-linux-gnu/4.3.3/include/varargs.h:5:2: error: #error "Revise your code to use <stdarg.h>."
configure:7172: $? = 1
configure: failed program was:
| /* confdefs.h. */
|
| #define PACKAGE_NAME "minicom"
| #define PACKAGE_TARNAME "minicom"
| #define PACKAGE_VERSION "2.2"
| #define PACKAGE_STRING "minicom 2.2"
| #define PACKAGE_BUGREPORT "minicom-devel@lists.alioth.debian.org"
| #define PACKAGE "minicom"
| #define VERSION "2.2"
| #define STDC_HEADERS 1
| #define HAVE_SYS_TYPES_H 1
| #define HAVE_SYS_STAT_H 1
| #define HAVE_STDLIB_H 1
| #define HAVE_STRING_H 1
| #define HAVE_MEMORY_H 1
| #define HAVE_STRINGS_H 1
| #define HAVE_INTTYPES_H 1
| #define HAVE_STDINT_H 1
| #define HAVE_UNISTD_H 1
| #define USE_SOCKET 1
| #define ENABLE_NLS 1
| #define HAVE_GETTEXT 1
| #define HAVE_DCGETTEXT 1
| #define KERMIT ""
| #define HAVE_DIRENT_H 1
| #define STDC_HEADERS 1
| #define HAVE_SYS_WAIT_H 1
| #define TIME_WITH_SYS_TIME 1
| #define GWINSZ_IN_SYS_IOCTL 1
| #define POSIX_TERMIOS 1
| #define HAVE_STDARG_H 1
| /* end confdefs.h. */
| #include <stdio.h>
| #if HAVE_SYS_TYPES_H
| # include <sys/types.h>
| #endif
| #if HAVE_SYS_STAT_H
| # include <sys/stat.h>
| #endif
| #if STDC_HEADERS
| # include <stdlib.h>
| # include <stddef.h>
| #else
| # if HAVE_STDLIB_H
| # include <stdlib.h>
| # endif
| #endif
| #if HAVE_STRING_H
| # if !STDC_HEADERS && HAVE_MEMORY_H
| # include <memory.h>
| # endif
| # include <string.h>
| #endif
| #if HAVE_STRINGS_H
| # include <strings.h>
| #endif
| #if HAVE_INTTYPES_H
| # include <inttypes.h>
| #else
| # if HAVE_STDINT_H
| # include <stdint.h>
| # endif
| #endif
| #if HAVE_UNISTD_H
| # include <unistd.h>
| #endif
| #include <varargs.h>
configure:7194: result: no
configure:7198: checking varargs.h presence
configure:7208: gcc -E conftest.c
In file included from conftest.c:33:
/usr/lib/gcc/i486-linux-gnu/4.3.3/include/varargs.h:4:2: error: #error "GCC no longer implements <varargs.h>."
/usr/lib/gcc/i486-linux-gnu/4.3.3/include/varargs.h:5:2: error: #error "Revise your code to use <stdarg.h>."
configure:7214: $? = 1
configure: failed program was:
| /* confdefs.h. */
|
| #define PACKAGE_NAME "minicom"
| #define PACKAGE_TARNAME "minicom"
| #define PACKAGE_VERSION "2.2"
| #define PACKAGE_STRING "minicom 2.2"
| #define PACKAGE_BUGREPORT "minicom-devel@lists.alioth.debian.org"
| #define PACKAGE "minicom"
| #define VERSION "2.2"
| #define STDC_HEADERS 1
| #define HAVE_SYS_TYPES_H 1
| #define HAVE_SYS_STAT_H 1
| #define HAVE_STDLIB_H 1
| #define HAVE_STRING_H 1
| #define HAVE_MEMORY_H 1
| #define HAVE_STRINGS_H 1
| #define HAVE_INTTYPES_H 1
| #define HAVE_STDINT_H 1
| #define HAVE_UNISTD_H 1
| #define USE_SOCKET 1
| #define ENABLE_NLS 1
| #define HAVE_GETTEXT 1
| #define HAVE_DCGETTEXT 1
| #define KERMIT ""
| #define HAVE_DIRENT_H 1
| #define STDC_HEADERS 1
| #define HAVE_SYS_WAIT_H 1
| #define TIME_WITH_SYS_TIME 1
| #define GWINSZ_IN_SYS_IOCTL 1
| #define POSIX_TERMIOS 1
| #define HAVE_STDARG_H 1
| /* end confdefs.h. */
| #include <varargs.h>
configure:7234: result: no
configure:7269: checking for varargs.h
configure:7276: result: no
configure:7154: checking termcap.h usability
configure:7166: gcc -c -g -O2 conftest.c >&5
conftest.c:67:21: error: termcap.h: No such file or directory
configure:7172: $? = 1
configure: failed program was:
| /* confdefs.h. */
|
| #define PACKAGE_NAME "minicom"
| #define PACKAGE_TARNAME "minicom"
| #define PACKAGE_VERSION "2.2"
| #define PACKAGE_STRING "minicom 2.2"
| #define PACKAGE_BUGREPORT "minicom-devel@lists.alioth.debian.org"
| #define PACKAGE "minicom"
| #define VERSION "2.2"
| #define STDC_HEADERS 1
| #define HAVE_SYS_TYPES_H 1
| #define HAVE_SYS_STAT_H 1
| #define HAVE_STDLIB_H 1
| #define HAVE_STRING_H 1
| #define HAVE_MEMORY_H 1
| #define HAVE_STRINGS_H 1
| #define HAVE_INTTYPES_H 1
| #define HAVE_STDINT_H 1
| #define HAVE_UNISTD_H 1
| #define USE_SOCKET 1
| #define ENABLE_NLS 1
| #define HAVE_GETTEXT 1
| #define HAVE_DCGETTEXT 1
| #define KERMIT ""
| #define HAVE_DIRENT_H 1
| #define STDC_HEADERS 1
| #define HAVE_SYS_WAIT_H 1
| #define TIME_WITH_SYS_TIME 1
| #define GWINSZ_IN_SYS_IOCTL 1
| #define POSIX_TERMIOS 1
| #define HAVE_STDARG_H 1
| /* end confdefs.h. */
| #include <stdio.h>
| #if HAVE_SYS_TYPES_H
| # include <sys/types.h>
| #endif
| #if HAVE_SYS_STAT_H
| # include <sys/stat.h>
| #endif
| #if STDC_HEADERS
| # include <stdlib.h>
| # include <stddef.h>
| #else
| # if HAVE_STDLIB_H
| # include <stdlib.h>
| # endif
| #endif
| #if HAVE_STRING_H
| # if !STDC_HEADERS && HAVE_MEMORY_H
| # include <memory.h>
| # endif
| # include <string.h>
| #endif
| #if HAVE_STRINGS_H
| # include <strings.h>
| #endif
| #if HAVE_INTTYPES_H
| # include <inttypes.h>
| #else
| # if HAVE_STDINT_H
| # include <stdint.h>
| # endif
| #endif
| #if HAVE_UNISTD_H
| # include <unistd.h>
| #endif
| #include <termcap.h>
configure:7194: result: no
configure:7198: checking termcap.h presence
configure:7208: gcc -E conftest.c
conftest.c:33:21: error: termcap.h: No such file or directory
configure:7214: $? = 1
configure: failed program was:
| /* confdefs.h. */
|
| #define PACKAGE_NAME "minicom"
| #define PACKAGE_TARNAME "minicom"
| #define PACKAGE_VERSION "2.2"
| #define PACKAGE_STRING "minicom 2.2"
| #define PACKAGE_BUGREPORT "minicom-devel@lists.alioth.debian.org"
| #define PACKAGE "minicom"
| #define VERSION "2.2"
| #define STDC_HEADERS 1
| #define HAVE_SYS_TYPES_H 1
| #define HAVE_SYS_STAT_H 1
| #define HAVE_STDLIB_H 1
| #define HAVE_STRING_H 1
| #define HAVE_MEMORY_H 1
| #define HAVE_STRINGS_H 1
| #define HAVE_INTTYPES_H 1
| #define HAVE_STDINT_H 1
| #define HAVE_UNISTD_H 1
| #define USE_SOCKET 1
| #define ENABLE_NLS 1
| #define HAVE_GETTEXT 1
| #define HAVE_DCGETTEXT 1
| #define KERMIT ""
| #define HAVE_DIRENT_H 1
| #define STDC_HEADERS 1
| #define HAVE_SYS_WAIT_H 1
| #define TIME_WITH_SYS_TIME 1
| #define GWINSZ_IN_SYS_IOCTL 1
| #define POSIX_TERMIOS 1
| #define HAVE_STDARG_H 1
| /* end confdefs.h. */
| #include <termcap.h>
configure:7234: result: no
configure:7269: checking for termcap.h
configure:7276: result: no
configure:7154: checking termio.h usability
configure:7166: gcc -c -g -O2 conftest.c >&5
configure:7172: $? = 0
configure:7175: test -z || test ! -s conftest.err
configure:7178: $? = 0
configure:7181: test -s conftest.o
configure:7184: $? = 0
configure:7194: result: yes
configure:7198: checking termio.h presence
configure:7208: gcc -E conftest.c
configure:7214: $? = 0
configure:7234: result: yes
configure:7269: checking for termio.h
configure:7276: result: yes
configure:7154: checking termios.h usability
configure:7166: gcc -c -g -O2 conftest.c >&5
configure:7172: $? = 0
configure:7175: test -z || test ! -s conftest.err
configure:7178: $? = 0
configure:7181: test -s conftest.o
configure:7184: $? = 0
configure:7194: result: yes
configure:7198: checking termios.h presence
configure:7208: gcc -E conftest.c
configure:7214: $? = 0
configure:7234: result: yes
configure:7269: checking for termios.h
configure:7276: result: yes
configure:7154: checking setjmp.h usability
configure:7166: gcc -c -g -O2 conftest.c >&5
configure:7172: $? = 0
configure:7175: test -z || test ! -s conftest.err
configure:7178: $? = 0
configure:7181: test -s conftest.o
configure:7184: $? = 0
configure:7194: result: yes
configure:7198: checking setjmp.h presence
configure:7208: gcc -E conftest.c
configure:7214: $? = 0
configure:7234: result: yes
configure:7269: checking for setjmp.h
configure:7276: result: yes
configure:7154: checking errno.h usability
configure:7166: gcc -c -g -O2 conftest.c >&5
configure:7172: $? = 0
configure:7175: test -z || test ! -s conftest.err
configure:7178: $? = 0
configure:7181: test -s conftest.o
configure:7184: $? = 0
configure:7194: result: yes
configure:7198: checking errno.h presence
configure:7208: gcc -E conftest.c
configure:7214: $? = 0
configure:7234: result: yes
configure:7269: checking for errno.h
configure:7276: result: yes
configure:7154: checking pwd.h usability
configure:7166: gcc -c -g -O2 conftest.c >&5
configure:7172: $? = 0
configure:7175: test -z || test ! -s conftest.err
configure:7178: $? = 0
configure:7181: test -s conftest.o
configure:7184: $? = 0
configure:7194: result: yes
configure:7198: checking pwd.h presence
configure:7208: gcc -E conftest.c
configure:7214: $? = 0
configure:7234: result: yes
configure:7269: checking for pwd.h
configure:7276: result: yes
configure:7154: checking signal.h usability
configure:7166: gcc -c -g -O2 conftest.c >&5
configure:7172: $? = 0
configure:7175: test -z || test ! -s conftest.err
configure:7178: $? = 0
configure:7181: test -s conftest.o
configure:7184: $? = 0
configure:7194: result: yes
configure:7198: checking signal.h presence
configure:7208: gcc -E conftest.c
configure:7214: $? = 0
configure:7234: result: yes
configure:7269: checking for signal.h
configure:7276: result: yes
configure:7154: checking fcntl.h usability
configure:7166: gcc -c -g -O2 conftest.c >&5
configure:7172: $? = 0
configure:7175: test -z || test ! -s conftest.err
configure:7178: $? = 0
configure:7181: test -s conftest.o
configure:7184: $? = 0
configure:7194: result: yes
configure:7198: checking fcntl.h presence
configure:7208: gcc -E conftest.c
configure:7214: $? = 0
configure:7234: result: yes
configure:7269: checking for fcntl.h
configure:7276: result: yes
configure:7154: checking sgtty.h usability
configure:7166: gcc -c -g -O2 conftest.c >&5
configure:7172: $? = 0
configure:7175: test -z || test ! -s conftest.err
configure:7178: $? = 0
configure:7181: test -s conftest.o
configure:7184: $? = 0
configure:7194: result: yes
configure:7198: checking sgtty.h presence
configure:7208: gcc -E conftest.c
configure:7214: $? = 0
configure:7234: result: yes
configure:7269: checking for sgtty.h
configure:7276: result: yes
configure:7154: checking locale.h usability
configure:7166: gcc -c -g -O2 conftest.c >&5
configure:7172: $? = 0
configure:7175: test -z || test ! -s conftest.err
configure:7178: $? = 0
configure:7181: test -s conftest.o
configure:7184: $? = 0
configure:7194: result: yes
configure:7198: checking locale.h presence
configure:7208: gcc -E conftest.c
configure:7214: $? = 0
configure:7234: result: yes
configure:7269: checking for locale.h
configure:7276: result: yes
configure:7154: checking sys/ptem.h usability
configure:7166: gcc -c -g -O2 conftest.c >&5
conftest.c:76:22: error: sys/ptem.h: No such file or directory
configure:7172: $? = 1
configure: failed program was:
| /* confdefs.h. */
|
| #define PACKAGE_NAME "minicom"
| #define PACKAGE_TARNAME "minicom"
| #define PACKAGE_VERSION "2.2"
| #define PACKAGE_STRING "minicom 2.2"
| #define PACKAGE_BUGREPORT "minicom-devel@lists.alioth.debian.org"
| #define PACKAGE "minicom"
| #define VERSION "2.2"
| #define STDC_HEADERS 1
| #define HAVE_SYS_TYPES_H 1
| #define HAVE_SYS_STAT_H 1
| #define HAVE_STDLIB_H 1
| #define HAVE_STRING_H 1
| #define HAVE_MEMORY_H 1
| #define HAVE_STRINGS_H 1
| #define HAVE_INTTYPES_H 1
| #define HAVE_STDINT_H 1
| #define HAVE_UNISTD_H 1
| #define USE_SOCKET 1
| #define ENABLE_NLS 1
| #define HAVE_GETTEXT 1
| #define HAVE_DCGETTEXT 1
| #define KERMIT ""
| #define HAVE_DIRENT_H 1
| #define STDC_HEADERS 1
| #define HAVE_SYS_WAIT_H 1
| #define TIME_WITH_SYS_TIME 1
| #define GWINSZ_IN_SYS_IOCTL 1
| #define POSIX_TERMIOS 1
| #define HAVE_STDARG_H 1
| #define HAVE_TERMIO_H 1
| #define HAVE_TERMIOS_H 1
| #define HAVE_SETJMP_H 1
| #define HAVE_ERRNO_H 1
| #define HAVE_PWD_H 1
| #define HAVE_SIGNAL_H 1
| #define HAVE_FCNTL_H 1
| #define HAVE_SGTTY_H 1
| #define HAVE_LOCALE_H 1
| /* end confdefs.h. */
| #include <stdio.h>
| #if HAVE_SYS_TYPES_H
| # include <sys/types.h>
| #endif
| #if HAVE_SYS_STAT_H
| # include <sys/stat.h>
| #endif
| #if STDC_HEADERS
| # include <stdlib.h>
| # include <stddef.h>
| #else
| # if HAVE_STDLIB_H
| # include <stdlib.h>
| # endif
| #endif
| #if HAVE_STRING_H
| # if !STDC_HEADERS && HAVE_MEMORY_H
| # include <memory.h>
| # endif
| # include <string.h>
| #endif
| #if HAVE_STRINGS_H
| # include <strings.h>
| #endif
| #if HAVE_INTTYPES_H
| # include <inttypes.h>
| #else
| # if HAVE_STDINT_H
| # include <stdint.h>
| # endif
| #endif
| #if HAVE_UNISTD_H
| # include <unistd.h>
| #endif
| #include <sys/ptem.h>
configure:7194: result: no
configure:7198: checking sys/ptem.h presence
configure:7208: gcc -E conftest.c
conftest.c:42:22: error: sys/ptem.h: No such file or directory
configure:7214: $? = 1
configure: failed program was:
| /* confdefs.h. */
|
| #define PACKAGE_NAME "minicom"
| #define PACKAGE_TARNAME "minicom"
| #define PACKAGE_VERSION "2.2"
| #define PACKAGE_STRING "minicom 2.2"
| #define PACKAGE_BUGREPORT "minicom-devel@lists.alioth.debian.org"
| #define PACKAGE "minicom"
| #define VERSION "2.2"
| #define STDC_HEADERS 1
| #define HAVE_SYS_TYPES_H 1
| #define HAVE_SYS_STAT_H 1
| #define HAVE_STDLIB_H 1
| #define HAVE_STRING_H 1
| #define HAVE_MEMORY_H 1
| #define HAVE_STRINGS_H 1
| #define HAVE_INTTYPES_H 1
| #define HAVE_STDINT_H 1
| #define HAVE_UNISTD_H 1
| #define USE_SOCKET 1
| #define ENABLE_NLS 1
| #define HAVE_GETTEXT 1
| #define HAVE_DCGETTEXT 1
| #define KERMIT ""
| #define HAVE_DIRENT_H 1
| #define STDC_HEADERS 1
| #define HAVE_SYS_WAIT_H 1
| #define TIME_WITH_SYS_TIME 1
| #define GWINSZ_IN_SYS_IOCTL 1
| #define POSIX_TERMIOS 1
| #define HAVE_STDARG_H 1
| #define HAVE_TERMIO_H 1
| #define HAVE_TERMIOS_H 1
| #define HAVE_SETJMP_H 1
| #define HAVE_ERRNO_H 1
| #define HAVE_PWD_H 1
| #define HAVE_SIGNAL_H 1
| #define HAVE_FCNTL_H 1
| #define HAVE_SGTTY_H 1
| #define HAVE_LOCALE_H 1
| /* end confdefs.h. */
| #include <sys/ptem.h>
configure:7234: result: no
configure:7269: checking for sys/ptem.h
configure:7276: result: no
configure:7145: checking for sys/stat.h
configure:7150: result: yes
configure:7154: checking sys/file.h usability
configure:7166: gcc -c -g -O2 conftest.c >&5
configure:7172: $? = 0
configure:7175: test -z || test ! -s conftest.err
configure:7178: $? = 0
configure:7181: test -s conftest.o
configure:7184: $? = 0
configure:7194: result: yes
configure:7198: checking sys/file.h presence
configure:7208: gcc -E conftest.c
configure:7214: $? = 0
configure:7234: result: yes
configure:7269: checking for sys/file.h
configure:7276: result: yes
configure:7154: checking sys/ioctl.h usability
configure:7166: gcc -c -g -O2 conftest.c >&5
configure:7172: $? = 0
configure:7175: test -z || test ! -s conftest.err
configure:7178: $? = 0
configure:7181: test -s conftest.o
configure:7184: $? = 0
configure:7194: result: yes
configure:7198: checking sys/ioctl.h presence
configure:7208: gcc -E conftest.c
configure:7214: $? = 0
configure:7234: result: yes
configure:7269: checking for sys/ioctl.h
configure:7276: result: yes
configure:7154: checking sys/time.h usability
configure:7166: gcc -c -g -O2 conftest.c >&5
configure:7172: $? = 0
configure:7175: test -z || test ! -s conftest.err
configure:7178: $? = 0
configure:7181: test -s conftest.o
configure:7184: $? = 0
configure:7194: result: yes
configure:7198: checking sys/time.h presence
configure:7208: gcc -E conftest.c
configure:7214: $? = 0
configure:7234: result: yes
configure:7269: checking for sys/time.h
configure:7276: result: yes
configure:7154: checking sys/ttold.h usability
configure:7166: gcc -c -g -O2 conftest.c >&5
conftest.c:80:23: error: sys/ttold.h: No such file or directory
configure:7172: $? = 1
configure: failed program was:
| /* confdefs.h. */
|
| #define PACKAGE_NAME "minicom"
| #define PACKAGE_TARNAME "minicom"
| #define PACKAGE_VERSION "2.2"
| #define PACKAGE_STRING "minicom 2.2"
| #define PACKAGE_BUGREPORT "minicom-devel@lists.alioth.debian.org"
| #define PACKAGE "minicom"
| #define VERSION "2.2"
| #define STDC_HEADERS 1
| #define HAVE_SYS_TYPES_H 1
| #define HAVE_SYS_STAT_H 1
| #define HAVE_STDLIB_H 1
| #define HAVE_STRING_H 1
| #define HAVE_MEMORY_H 1
| #define HAVE_STRINGS_H 1
| #define HAVE_INTTYPES_H 1
| #define HAVE_STDINT_H 1
| #define HAVE_UNISTD_H 1
| #define USE_SOCKET 1
| #define ENABLE_NLS 1
| #define HAVE_GETTEXT 1
| #define HAVE_DCGETTEXT 1
| #define KERMIT ""
| #define HAVE_DIRENT_H 1
| #define STDC_HEADERS 1
| #define HAVE_SYS_WAIT_H 1
| #define TIME_WITH_SYS_TIME 1
| #define GWINSZ_IN_SYS_IOCTL 1
| #define POSIX_TERMIOS 1
| #define HAVE_STDARG_H 1
| #define HAVE_TERMIO_H 1
| #define HAVE_TERMIOS_H 1
| #define HAVE_SETJMP_H 1
| #define HAVE_ERRNO_H 1
| #define HAVE_PWD_H 1
| #define HAVE_SIGNAL_H 1
| #define HAVE_FCNTL_H 1
| #define HAVE_SGTTY_H 1
| #define HAVE_LOCALE_H 1
| #define HAVE_SYS_STAT_H 1
| #define HAVE_SYS_FILE_H 1
| #define HAVE_SYS_IOCTL_H 1
| #define HAVE_SYS_TIME_H 1
| /* end confdefs.h. */
| #include <stdio.h>
| #if HAVE_SYS_TYPES_H
| # include <sys/types.h>
| #endif
| #if HAVE_SYS_STAT_H
| # include <sys/stat.h>
| #endif
| #if STDC_HEADERS
| # include <stdlib.h>
| # include <stddef.h>
| #else
| # if HAVE_STDLIB_H
| # include <stdlib.h>
| # endif
| #endif
| #if HAVE_STRING_H
| # if !STDC_HEADERS && HAVE_MEMORY_H
| # include <memory.h>
| # endif
| # include <string.h>
| #endif
| #if HAVE_STRINGS_H
| # include <strings.h>
| #endif
| #if HAVE_INTTYPES_H
| # include <inttypes.h>
| #else
| # if HAVE_STDINT_H
| # include <stdint.h>
| # endif
| #endif
| #if HAVE_UNISTD_H
| # include <unistd.h>
| #endif
| #include <sys/ttold.h>
configure:7194: result: no
configure:7198: checking sys/ttold.h presence
configure:7208: gcc -E conftest.c
conftest.c:46:23: error: sys/ttold.h: No such file or directory
configure:7214: $? = 1
configure: failed program was:
| /* confdefs.h. */
|
| #define PACKAGE_NAME "minicom"
| #define PACKAGE_TARNAME "minicom"
| #define PACKAGE_VERSION "2.2"
| #define PACKAGE_STRING "minicom 2.2"
| #define PACKAGE_BUGREPORT "minicom-devel@lists.alioth.debian.org"
| #define PACKAGE "minicom"
| #define VERSION "2.2"
| #define STDC_HEADERS 1
| #define HAVE_SYS_TYPES_H 1
| #define HAVE_SYS_STAT_H 1
| #define HAVE_STDLIB_H 1
| #define HAVE_STRING_H 1
| #define HAVE_MEMORY_H 1
| #define HAVE_STRINGS_H 1
| #define HAVE_INTTYPES_H 1
| #define HAVE_STDINT_H 1
| #define HAVE_UNISTD_H 1
| #define USE_SOCKET 1
| #define ENABLE_NLS 1
| #define HAVE_GETTEXT 1
| #define HAVE_DCGETTEXT 1
| #define KERMIT ""
| #define HAVE_DIRENT_H 1
| #define STDC_HEADERS 1
| #define HAVE_SYS_WAIT_H 1
| #define TIME_WITH_SYS_TIME 1
| #define GWINSZ_IN_SYS_IOCTL 1
| #define POSIX_TERMIOS 1
| #define HAVE_STDARG_H 1
| #define HAVE_TERMIO_H 1
| #define HAVE_TERMIOS_H 1
| #define HAVE_SETJMP_H 1
| #define HAVE_ERRNO_H 1
| #define HAVE_PWD_H 1
| #define HAVE_SIGNAL_H 1
| #define HAVE_FCNTL_H 1
| #define HAVE_SGTTY_H 1
| #define HAVE_LOCALE_H 1
| #define HAVE_SYS_STAT_H 1
| #define HAVE_SYS_FILE_H 1
| #define HAVE_SYS_IOCTL_H 1
| #define HAVE_SYS_TIME_H 1
| /* end confdefs.h. */
| #include <sys/ttold.h>
configure:7234: result: no
configure:7269: checking for sys/ttold.h
configure:7276: result: no
configure:7154: checking sys/param.h usability
configure:7166: gcc -c -g -O2 conftest.c >&5
configure:7172: $? = 0
configure:7175: test -z || test ! -s conftest.err
configure:7178: $? = 0
configure:7181: test -s conftest.o
configure:7184: $? = 0
configure:7194: result: yes
configure:7198: checking sys/param.h presence
configure:7208: gcc -E conftest.c
configure:7214: $? = 0
configure:7234: result: yes
configure:7269: checking for sys/param.h
configure:7276: result: yes
configure:7145: checking for unistd.h
configure:7150: result: yes
configure:7154: checking posix1_lim.h usability
configure:7166: gcc -c -g -O2 conftest.c >&5
conftest.c:82:24: error: posix1_lim.h: No such file or directory
configure:7172: $? = 1
configure: failed program was:
| /* confdefs.h. */
|
| #define PACKAGE_NAME "minicom"
| #define PACKAGE_TARNAME "minicom"
| #define PACKAGE_VERSION "2.2"
| #define PACKAGE_STRING "minicom 2.2"
| #define PACKAGE_BUGREPORT "minicom-devel@lists.alioth.debian.org"
| #define PACKAGE "minicom"
| #define VERSION "2.2"
| #define STDC_HEADERS 1
| #define HAVE_SYS_TYPES_H 1
| #define HAVE_SYS_STAT_H 1
| #define HAVE_STDLIB_H 1
| #define HAVE_STRING_H 1
| #define HAVE_MEMORY_H 1
| #define HAVE_STRINGS_H 1
| #define HAVE_INTTYPES_H 1
| #define HAVE_STDINT_H 1
| #define HAVE_UNISTD_H 1
| #define USE_SOCKET 1
| #define ENABLE_NLS 1
| #define HAVE_GETTEXT 1
| #define HAVE_DCGETTEXT 1
| #define KERMIT ""
| #define HAVE_DIRENT_H 1
| #define STDC_HEADERS 1
| #define HAVE_SYS_WAIT_H 1
| #define TIME_WITH_SYS_TIME 1
| #define GWINSZ_IN_SYS_IOCTL 1
| #define POSIX_TERMIOS 1
| #define HAVE_STDARG_H 1
| #define HAVE_TERMIO_H 1
| #define HAVE_TERMIOS_H 1
| #define HAVE_SETJMP_H 1
| #define HAVE_ERRNO_H 1
| #define HAVE_PWD_H 1
| #define HAVE_SIGNAL_H 1
| #define HAVE_FCNTL_H 1
| #define HAVE_SGTTY_H 1
| #define HAVE_LOCALE_H 1
| #define HAVE_SYS_STAT_H 1
| #define HAVE_SYS_FILE_H 1
| #define HAVE_SYS_IOCTL_H 1
| #define HAVE_SYS_TIME_H 1
| #define HAVE_SYS_PARAM_H 1
| #define HAVE_UNISTD_H 1
| /* end confdefs.h. */
| #include <stdio.h>
| #if HAVE_SYS_TYPES_H
| # include <sys/types.h>
| #endif
| #if HAVE_SYS_STAT_H
| # include <sys/stat.h>
| #endif
| #if STDC_HEADERS
| # include <stdlib.h>
| # include <stddef.h>
| #else
| # if HAVE_STDLIB_H
| # include <stdlib.h>
| # endif
| #endif
| #if HAVE_STRING_H
| # if !STDC_HEADERS && HAVE_MEMORY_H
| # include <memory.h>
| # endif
| # include <string.h>
| #endif
| #if HAVE_STRINGS_H
| # include <strings.h>
| #endif
| #if HAVE_INTTYPES_H
| # include <inttypes.h>
| #else
| # if HAVE_STDINT_H
| # include <stdint.h>
| # endif
| #endif
| #if HAVE_UNISTD_H
| # include <unistd.h>
| #endif
| #include <posix1_lim.h>
configure:7194: result: no
configure:7198: checking posix1_lim.h presence
configure:7208: gcc -E conftest.c
conftest.c:48:24: error: posix1_lim.h: No such file or directory
configure:7214: $? = 1
configure: failed program was:
| /* confdefs.h. */
|
| #define PACKAGE_NAME "minicom"
| #define PACKAGE_TARNAME "minicom"
| #define PACKAGE_VERSION "2.2"
| #define PACKAGE_STRING "minicom 2.2"
| #define PACKAGE_BUGREPORT "minicom-devel@lists.alioth.debian.org"
| #define PACKAGE "minicom"
| #define VERSION "2.2"
| #define STDC_HEADERS 1
| #define HAVE_SYS_TYPES_H 1
| #define HAVE_SYS_STAT_H 1
| #define HAVE_STDLIB_H 1
| #define HAVE_STRING_H 1
| #define HAVE_MEMORY_H 1
| #define HAVE_STRINGS_H 1
| #define HAVE_INTTYPES_H 1
| #define HAVE_STDINT_H 1
| #define HAVE_UNISTD_H 1
| #define USE_SOCKET 1
| #define ENABLE_NLS 1
| #define HAVE_GETTEXT 1
| #define HAVE_DCGETTEXT 1
| #define KERMIT ""
| #define HAVE_DIRENT_H 1
| #define STDC_HEADERS 1
| #define HAVE_SYS_WAIT_H 1
| #define TIME_WITH_SYS_TIME 1
| #define GWINSZ_IN_SYS_IOCTL 1
| #define POSIX_TERMIOS 1
| #define HAVE_STDARG_H 1
| #define HAVE_TERMIO_H 1
| #define HAVE_TERMIOS_H 1
| #define HAVE_SETJMP_H 1
| #define HAVE_ERRNO_H 1
| #define HAVE_PWD_H 1
| #define HAVE_SIGNAL_H 1
| #define HAVE_FCNTL_H 1
| #define HAVE_SGTTY_H 1
| #define HAVE_LOCALE_H 1
| #define HAVE_SYS_STAT_H 1
| #define HAVE_SYS_FILE_H 1
| #define HAVE_SYS_IOCTL_H 1
| #define HAVE_SYS_TIME_H 1
| #define HAVE_SYS_PARAM_H 1
| #define HAVE_UNISTD_H 1
| /* end confdefs.h. */
| #include <posix1_lim.h>
configure:7234: result: no
configure:7269: checking for posix1_lim.h
configure:7276: result: no
configure:7145: checking for sgtty.h
configure:7150: result: yes
configure:7154: checking features.h usability
configure:7166: gcc -c -g -O2 conftest.c >&5
configure:7172: $? = 0
configure:7175: test -z || test ! -s conftest.err
configure:7178: $? = 0
configure:7181: test -s conftest.o
configure:7184: $? = 0
configure:7194: result: yes
configure:7198: checking features.h presence
configure:7208: gcc -E conftest.c
configure:7214: $? = 0
configure:7234: result: yes
configure:7269: checking for features.h
configure:7276: result: yes
configure:7290: checking for an ANSI C-conforming const
configure:7357: gcc -c -g -O2 conftest.c >&5
configure:7363: $? = 0
configure:7366: test -z || test ! -s conftest.err
configure:7369: $? = 0
configure:7372: test -s conftest.o
configure:7375: $? = 0
configure:7386: result: yes
configure:7396: checking for function prototypes
configure:7399: result: yes
configure:7429: checking for string.h
configure:7434: result: yes
configure:7574: checking for uid_t in sys/types.h
configure:7597: result: yes
configure:7612: checking for mode_t
configure:7636: gcc -c -g -O2 conftest.c >&5
configure:7642: $? = 0
configure:7645: test -z || test ! -s conftest.err
configure:7648: $? = 0
configure:7651: test -s conftest.o
configure:7654: $? = 0
configure:7665: result: yes
configure:7677: checking for pid_t
configure:7701: gcc -c -g -O2 conftest.c >&5
configure:7707: $? = 0
configure:7710: test -z || test ! -s conftest.err
configure:7713: $? = 0
configure:7716: test -s conftest.o
configure:7719: $? = 0
configure:7730: result: yes
configure:7742: checking for size_t
configure:7766: gcc -c -g -O2 conftest.c >&5
configure:7772: $? = 0
configure:7775: test -z || test ! -s conftest.err
configure:7778: $? = 0
configure:7781: test -s conftest.o
configure:7784: $? = 0
configure:7795: result: yes
configure:7807: checking whether struct tm is in sys/time.h or time.h
configure:7830: gcc -c -g -O2 conftest.c >&5
configure:7836: $? = 0
configure:7839: test -z || test ! -s conftest.err
configure:7842: $? = 0
configure:7845: test -s conftest.o
configure:7848: $? = 0
configure:7859: result: time.h
configure:7870: checking return type of signal handlers
configure:7901: gcc -c -g -O2 conftest.c >&5
configure:7907: $? = 0
configure:7910: test -z || test ! -s conftest.err
configure:7913: $? = 0
configure:7916: test -s conftest.o
configure:7919: $? = 0
configure:7930: result: void
configure:7938: checking for error_at_line
configure:7959: gcc -o conftest -g -O2 conftest.c >&5
configure:7965: $? = 0
configure:7968: test -z || test ! -s conftest.err
configure:7971: $? = 0
configure:7974: test -s conftest
configure:7977: $? = 0
configure:7989: result: yes
configure:8002: checking whether closedir returns void
configure:8031: gcc -o conftest -g -O2 conftest.c >&5
configure:8034: $? = 0
configure:8036: ./conftest









大家看下是什么问题 用的是9.04 super os 制作的usb live
gcc version 4.3.3


页首
 用户资料  
 
2 楼 
 文章标题 : Re: com口工具minicom安装出错
帖子发表于 : 2009-11-01 14:16 

注册: 2008-11-17 12:46
帖子: 5
送出感谢: 0 次
接收感谢: 0 次
configure:8039: $? = 0
configure:8053: result: no
configure:8063: checking if malloc debugging is wanted
configure:8084: result: no
configure:8099: checking for getcwd
configure:8156: gcc -o conftest -g -O2 conftest.c >&5
configure:8162: $? = 0
configure:8165: test -z || test ! -s conftest.err
configure:8168: $? = 0
configure:8171: test -s conftest
configure:8174: $? = 0
configure:8186: result: yes
configure:8099: checking for getwd
configure:8156: gcc -o conftest -g -O2 conftest.c >&5
/tmp/ccAF4g4p.o: In function `main':
/home/ubuntu/Desktop/minicom-2.2/conftest.c:94: warning: the `getwd' function is dangerous and should not be used.
configure:8162: $? = 0
configure:8165: test -z || test ! -s conftest.err
configure:8168: $? = 0
configure:8171: test -s conftest
configure:8174: $? = 0
configure:8186: result: yes
configure:8099: checking for memmove
configure:8156: gcc -o conftest -g -O2 conftest.c >&5
conftest.c:80: warning: conflicting types for built-in function 'memmove'
configure:8162: $? = 0
configure:8165: test -z || test ! -s conftest.err
configure:8168: $? = 0
configure:8171: test -s conftest
configure:8174: $? = 0
configure:8186: result: yes
configure:8099: checking for strerror
configure:8156: gcc -o conftest -g -O2 conftest.c >&5
configure:8162: $? = 0
configure:8165: test -z || test ! -s conftest.err
configure:8168: $? = 0
configure:8171: test -s conftest
configure:8174: $? = 0
configure:8186: result: yes
configure:8099: checking for strstr
configure:8156: gcc -o conftest -g -O2 conftest.c >&5
conftest.c:82: warning: conflicting types for built-in function 'strstr'
configure:8162: $? = 0
configure:8165: test -z || test ! -s conftest.err
configure:8168: $? = 0
configure:8171: test -s conftest
configure:8174: $? = 0
configure:8186: result: yes
configure:8099: checking for vsnprintf
configure:8156: gcc -o conftest -g -O2 conftest.c >&5
conftest.c:83: warning: conflicting types for built-in function 'vsnprintf'
configure:8162: $? = 0
configure:8165: test -z || test ! -s conftest.err
configure:8168: $? = 0
configure:8171: test -s conftest
configure:8174: $? = 0
configure:8186: result: yes
configure:8099: checking for vprintf
configure:8156: gcc -o conftest -g -O2 conftest.c >&5
conftest.c:84: warning: conflicting types for built-in function 'vprintf'
configure:8162: $? = 0
configure:8165: test -z || test ! -s conftest.err
configure:8168: $? = 0
configure:8171: test -s conftest
configure:8174: $? = 0
configure:8186: result: yes
configure:8099: checking for select
configure:8156: gcc -o conftest -g -O2 conftest.c >&5
configure:8162: $? = 0
configure:8165: test -z || test ! -s conftest.err
configure:8168: $? = 0
configure:8171: test -s conftest
configure:8174: $? = 0
configure:8186: result: yes
configure:8206: checking for snprintf
configure:8263: gcc -o conftest -g -O2 conftest.c >&5
conftest.c:86: warning: conflicting types for built-in function 'snprintf'
configure:8269: $? = 0
configure:8272: test -z || test ! -s conftest.err
configure:8275: $? = 0
configure:8278: test -s conftest
configure:8281: $? = 0
configure:8293: result: yes
configure:8206: checking for usleep
configure:8263: gcc -o conftest -g -O2 conftest.c >&5
configure:8269: $? = 0
configure:8272: test -z || test ! -s conftest.err
configure:8275: $? = 0
configure:8278: test -s conftest
configure:8281: $? = 0
configure:8293: result: yes
configure:8206: checking for getopt
configure:8263: gcc -o conftest -g -O2 conftest.c >&5
configure:8269: $? = 0
configure:8272: test -z || test ! -s conftest.err
configure:8275: $? = 0
configure:8278: test -s conftest
configure:8281: $? = 0
configure:8293: result: yes
configure:8206: checking for getopt_long
configure:8263: gcc -o conftest -g -O2 conftest.c >&5
configure:8269: $? = 0
configure:8272: test -z || test ! -s conftest.err
configure:8275: $? = 0
configure:8278: test -s conftest
configure:8281: $? = 0
configure:8293: result: yes
configure:8314: checking for long file names
configure:8353: result: yes
configure:8365: checking for com line lock directory
configure:8389: result: /var/lock
configure:8410: checking for default serial port device
configure:8434: result: /dev/ttyS1
configure:8460: checking for default baud rate
configure:8474: result: 115200
configure:8615: creating ./config.status
## ---------------------- ##
## Running config.status. ##
## ---------------------- ##

This file was extended by minicom config.status 2.2, which was
generated by GNU Autoconf 2.59. Invocation command line was

CONFIG_FILES =
CONFIG_HEADERS =
CONFIG_LINKS =
CONFIG_COMMANDS =
$ ./config.status

on ubuntu

config.status:776: creating Makefile
config.status:776: creating doc/Makefile
config.status:776: creating extras/Makefile
config.status:776: creating extras/linux/Makefile
config.status:776: creating extras/tables/Makefile
config.status:776: creating extras/termcap/Makefile
config.status:776: creating extras/terminfo/Makefile
config.status:776: creating man/Makefile
config.status:776: creating lib/Makefile
config.status:776: creating src/Makefile
config.status:776: creating po/Makefile.in
config.status:776: creating minicom.spec
config.status:842: creating config.h
config.status:1244: executing depfiles commands
config.status:1244: executing default-1 commands

## ---------------- ##
## Cache variables. ##
## ---------------- ##

ac_cv_build=i686-pc-linux-gnu
ac_cv_build_alias=i686-pc-linux-gnu
ac_cv_c_compiler_gnu=yes
ac_cv_c_const=yes
ac_cv_env_CC_set=
ac_cv_env_CC_value=
ac_cv_env_CFLAGS_set=
ac_cv_env_CFLAGS_value=
ac_cv_env_CPPFLAGS_set=
ac_cv_env_CPPFLAGS_value=
ac_cv_env_CPP_set=
ac_cv_env_CPP_value=
ac_cv_env_LDFLAGS_set=
ac_cv_env_LDFLAGS_value=
ac_cv_env_build_alias_set=
ac_cv_env_build_alias_value=
ac_cv_env_host_alias_set=
ac_cv_env_host_alias_value=
ac_cv_env_target_alias_set=
ac_cv_env_target_alias_value=
ac_cv_exeext=
ac_cv_func_closedir_void=no
ac_cv_func_getcwd=yes
ac_cv_func_getopt=yes
ac_cv_func_getopt_long=yes
ac_cv_func_getwd=yes
ac_cv_func_memmove=yes
ac_cv_func_select=yes
ac_cv_func_snprintf=yes
ac_cv_func_strerror=yes
ac_cv_func_strstr=yes
ac_cv_func_usleep=yes
ac_cv_func_vprintf=yes
ac_cv_func_vsnprintf=yes
ac_cv_header_dirent_dirent_h=yes
ac_cv_header_errno_h=yes
ac_cv_header_fcntl_h=yes
ac_cv_header_features_h=yes
ac_cv_header_inttypes_h=yes
ac_cv_header_locale_h=yes
ac_cv_header_memory_h=yes
ac_cv_header_minix_config_h=no
ac_cv_header_posix1_lim_h=no
ac_cv_header_pwd_h=yes
ac_cv_header_setjmp_h=yes
ac_cv_header_sgtty_h=yes
ac_cv_header_signal_h=yes
ac_cv_header_stat_broken=no
ac_cv_header_stdarg_h=yes
ac_cv_header_stdc=yes
ac_cv_header_stdint_h=yes
ac_cv_header_stdlib_h=yes
ac_cv_header_string_h=yes
ac_cv_header_strings_h=yes
ac_cv_header_sys_file_h=yes
ac_cv_header_sys_ioctl_h=yes
ac_cv_header_sys_param_h=yes
ac_cv_header_sys_ptem_h=no
ac_cv_header_sys_stat_h=yes
ac_cv_header_sys_time_h=yes
ac_cv_header_sys_ttold_h=no
ac_cv_header_sys_types_h=yes
ac_cv_header_sys_wait_h=yes
ac_cv_header_termcap_h=no
ac_cv_header_termio_h=yes
ac_cv_header_termios_h=yes
ac_cv_header_time=yes
ac_cv_header_unistd_h=yes
ac_cv_header_varargs_h=no
ac_cv_host=i686-pc-linux-gnu
ac_cv_host_alias=i686-pc-linux-gnu
ac_cv_lib_curses___tputs=no
ac_cv_lib_error_at_line=yes
ac_cv_lib_ncurses___tputs=no
ac_cv_lib_socket_socket=no
ac_cv_lib_termcap___tputs=no
ac_cv_lib_terminfo___tputs=no
ac_cv_lib_termlib___tputs=no
ac_cv_lib_tinfo___tputs=no
ac_cv_objext=o
ac_cv_path_GMSGFMT=/usr/bin/msgfmt
ac_cv_path_MSGFMT=/usr/bin/msgfmt
ac_cv_path_MSGMERGE=/usr/bin/msgmerge
ac_cv_path_PATH_KERMIT=no
ac_cv_path_XGETTEXT=/usr/bin/xgettext
ac_cv_path_install='/usr/bin/install -c'
ac_cv_prog_AWK=mawk
ac_cv_prog_CPP='gcc -E'
ac_cv_prog_ac_ct_CC=gcc
ac_cv_prog_ac_ct_RANLIB=ranlib
ac_cv_prog_cc_g=yes
ac_cv_prog_cc_stdc=
ac_cv_prog_egrep='grep -E'
ac_cv_prog_make_make_set=yes
ac_cv_search_opendir='none required'
ac_cv_search_strerror='none required'
ac_cv_struct_tm=time.h
ac_cv_sys_long_file_names=yes
ac_cv_sys_posix_termios=yes
ac_cv_sys_tiocgwinsz_in_sys_ioctl_h=yes
ac_cv_sys_tiocgwinsz_in_termios_h=no
ac_cv_type_mode_t=yes
ac_cv_type_pid_t=yes
ac_cv_type_signal=void
ac_cv_type_size_t=yes
ac_cv_type_uid_t=yes
acl_cv_path_LD=/usr/bin/ld
acl_cv_prog_gnu_ld=yes
acl_cv_rpath=done
am_cv_CC_dependencies_compiler_type=gcc3
gt_cv_func_CFLocaleCopyCurrent=no
gt_cv_func_CFPreferencesCopyAppValue=no
gt_cv_func_gnugettext1_libc=yes

## ----------------- ##
## Output variables. ##
## ----------------- ##

ACLOCAL='${SHELL} /home/ubuntu/Desktop/minicom-2.2/missing --run aclocal-1.9'
AMDEPBACKSLASH='\'
AMDEP_FALSE='#'
AMDEP_TRUE=''
AMTAR='${SHELL} /home/ubuntu/Desktop/minicom-2.2/missing --run tar'
ANSI2KNR=''
AUTOCONF='${SHELL} /home/ubuntu/Desktop/minicom-2.2/missing --run autoconf'
AUTOHEADER='${SHELL} /home/ubuntu/Desktop/minicom-2.2/missing --run autoheader'
AUTOMAKE='${SHELL} /home/ubuntu/Desktop/minicom-2.2/missing --run automake-1.9'
AWK='mawk'
CC='gcc'
CCDEPMODE='depmode=gcc3'
CFLAGS='-g -O2'
CPP='gcc -E'
CPPFLAGS=''
CYGPATH_W='echo'
DEFS='-DHAVE_CONFIG_H'
DEPDIR='.deps'
ECHO_C=''
ECHO_N='-n'
ECHO_T=''
EGREP='grep -E'
EXEEXT=''
GMSGFMT='/usr/bin/msgfmt'
INSTALL_DATA='${INSTALL} -m 644'
INSTALL_PROGRAM='${INSTALL}'
INSTALL_SCRIPT='${INSTALL}'
INSTALL_STRIP_PROGRAM='${SHELL} $(install_sh) -c -s'
INTLLIBS=''
INTL_MACOSX_LIBS=''
KEYSERV=''
LDFLAGS=''
LIBICONV='-liconv'
LIBINTL=''
LIBOBJS=''
LIBPORT_GETOPT_LONG_DEP=''
LIBS=' '
LTLIBICONV='-liconv'
LTLIBINTL=''
LTLIBOBJS=''
MAKEINFO='${SHELL} /home/ubuntu/Desktop/minicom-2.2/missing --run makeinfo'
MINICOM_CONFDIR='${prefix}/etc'
MKINSTALLDIRS='$(top_builddir)/./mkinstalldirs'
MSGFMT='/usr/bin/msgfmt'
MSGMERGE='/usr/bin/msgmerge'
OBJEXT='o'
PACKAGE='minicom'
PACKAGE_BUGREPORT='minicom-devel@lists.alioth.debian.org'
PACKAGE_NAME='minicom'
PACKAGE_STRING='minicom 2.2'
PACKAGE_TARNAME='minicom'
PACKAGE_VERSION='2.2'
PATH_KERMIT='no'
PATH_SEPARATOR=':'
POSUB='po'
RANLIB='ranlib'
SET_MAKE=''
SHELL='/bin/bash'
STRIP=''
U=''
USE_NLS='yes'
VERSION='2.2'
XGETTEXT='/usr/bin/xgettext'
ac_ct_CC='gcc'
ac_ct_RANLIB='ranlib'
ac_ct_STRIP=''
am__fastdepCC_FALSE='#'
am__fastdepCC_TRUE=''
am__include='include'
am__leading_dot='.'
am__quote=''
am__tar='${AMTAR} chof - "$$tardir"'
am__untar='${AMTAR} xf -'
bindir='${exec_prefix}/bin'
build='i686-pc-linux-gnu'
build_alias=''
build_cpu='i686'
build_os='linux-gnu'
build_vendor='pc'
datadir='${prefix}/share'
exec_prefix='${prefix}'
host='i686-pc-linux-gnu'
host_alias=''
host_cpu='i686'
host_os='linux-gnu'
host_vendor='pc'
includedir='${prefix}/include'
infodir='${prefix}/info'
install_sh='/home/ubuntu/Desktop/minicom-2.2/install-sh'
libdir='${exec_prefix}/lib'
libexecdir='${exec_prefix}/libexec'
localstatedir='${prefix}/var'
mandir='${prefix}/man'
mkdir_p='mkdir -p --'
oldincludedir='/usr/include'
prefix='/usr/local'
program_transform_name='s,x,x,'
sbindir='${exec_prefix}/sbin'
sharedstatedir='${prefix}/com'
sysconfdir='${prefix}/etc'
target_alias=''

## ----------- ##
## confdefs.h. ##
## ----------- ##

#define DEF_BAUD "115200"
#define DFL_PORT "/dev/ttyS1"
#define ENABLE_NLS 1
#define GWINSZ_IN_SYS_IOCTL 1
#define HAVE_DCGETTEXT 1
#define HAVE_DIRENT_H 1
#define HAVE_ERRNO_H 1
#define HAVE_FCNTL_H 1
#define HAVE_FEATURES_H 1
#define HAVE_GETCWD 1
#define HAVE_GETOPT 1
#define HAVE_GETOPT_LONG 1
#define HAVE_GETTEXT 1
#define HAVE_GETWD 1
#define HAVE_INTTYPES_H 1
#define HAVE_LOCALE_H 1
#define HAVE_LONG_FILE_NAMES 1
#define HAVE_MEMMOVE 1
#define HAVE_MEMORY_H 1
#define HAVE_PWD_H 1
#define HAVE_SELECT 1
#define HAVE_SETJMP_H 1
#define HAVE_SGTTY_H 1
#define HAVE_SGTTY_H 1
#define HAVE_SIGNAL_H 1
#define HAVE_SNPRINTF 1
#define HAVE_STDARG_H 1
#define HAVE_STDINT_H 1
#define HAVE_STDLIB_H 1
#define HAVE_STRERROR 1
#define HAVE_STRINGS_H 1
#define HAVE_STRING_H 1
#define HAVE_STRING_H 1
#define HAVE_STRSTR 1
#define HAVE_SYS_FILE_H 1
#define HAVE_SYS_IOCTL_H 1
#define HAVE_SYS_PARAM_H 1
#define HAVE_SYS_STAT_H 1
#define HAVE_SYS_STAT_H 1
#define HAVE_SYS_TIME_H 1
#define HAVE_SYS_TYPES_H 1
#define HAVE_SYS_WAIT_H 1
#define HAVE_TERMIOS_H 1
#define HAVE_TERMIO_H 1
#define HAVE_UNISTD_H 1
#define HAVE_UNISTD_H 1
#define HAVE_USLEEP 1
#define HAVE_VPRINTF 1
#define HAVE_VSNPRINTF 1
#define KERMIT ""
#define PACKAGE "minicom"
#define PACKAGE_BUGREPORT "minicom-devel@lists.alioth.debian.org"
#define PACKAGE_NAME "minicom"
#define PACKAGE_STRING "minicom 2.2"
#define PACKAGE_TARNAME "minicom"
#define PACKAGE_VERSION "2.2"
#define POSIX_TERMIOS 1
#define PROTOTYPES 1
#define RETSIGTYPE void
#define STDC_HEADERS 1
#define STDC_HEADERS 1
#define TIME_WITH_SYS_TIME 1
#define USE_SOCKET 1
#define UUCPLOCK "/var/lock"
#define VERSION "2.2"
#define __PROTOTYPES 1

configure: exit 0


页首
 用户资料  
 
3 楼 
 文章标题 : Re: com口工具minicom安装出错
帖子发表于 : 2009-11-01 14:17 

注册: 2008-11-17 12:46
帖子: 5
送出感谢: 0 次
接收感谢: 0 次
root@ubuntu:~/Desktop/minicom-2.3# make
make all-recursive
make[1]: Entering directory `/home/ubuntu/Desktop/minicom-2.3'
Making all in doc
make[2]: Entering directory `/home/ubuntu/Desktop/minicom-2.3/doc'
make[2]: Nothing to be done for `all'.
make[2]: Leaving directory `/home/ubuntu/Desktop/minicom-2.3/doc'
Making all in extras
make[2]: Entering directory `/home/ubuntu/Desktop/minicom-2.3/extras'
Making all in linux
make[3]: Entering directory `/home/ubuntu/Desktop/minicom-2.3/extras/linux'
make[3]: Nothing to be done for `all'.
make[3]: Leaving directory `/home/ubuntu/Desktop/minicom-2.3/extras/linux'
Making all in tables
make[3]: Entering directory `/home/ubuntu/Desktop/minicom-2.3/extras/tables'
make[3]: Nothing to be done for `all'.
make[3]: Leaving directory `/home/ubuntu/Desktop/minicom-2.3/extras/tables'
Making all in termcap
make[3]: Entering directory `/home/ubuntu/Desktop/minicom-2.3/extras/termcap'
make[3]: Nothing to be done for `all'.
make[3]: Leaving directory `/home/ubuntu/Desktop/minicom-2.3/extras/termcap'
Making all in terminfo
make[3]: Entering directory `/home/ubuntu/Desktop/minicom-2.3/extras/terminfo'
make[3]: Nothing to be done for `all'.
make[3]: Leaving directory `/home/ubuntu/Desktop/minicom-2.3/extras/terminfo'
make[3]: Entering directory `/home/ubuntu/Desktop/minicom-2.3/extras'
make[3]: Nothing to be done for `all-am'.
make[3]: Leaving directory `/home/ubuntu/Desktop/minicom-2.3/extras'
make[2]: Leaving directory `/home/ubuntu/Desktop/minicom-2.3/extras'
Making all in man
make[2]: Entering directory `/home/ubuntu/Desktop/minicom-2.3/man'
make[2]: Nothing to be done for `all'.
make[2]: Leaving directory `/home/ubuntu/Desktop/minicom-2.3/man'
Making all in po
make[2]: Entering directory `/home/ubuntu/Desktop/minicom-2.3/po'
make[2]: Nothing to be done for `all'.
make[2]: Leaving directory `/home/ubuntu/Desktop/minicom-2.3/po'
Making all in lib
make[2]: Entering directory `/home/ubuntu/Desktop/minicom-2.3/lib'
rm -f libport.a
ar cru libport.a
ranlib libport.a
make[2]: Leaving directory `/home/ubuntu/Desktop/minicom-2.3/lib'
Making all in src
make[2]: Entering directory `/home/ubuntu/Desktop/minicom-2.3/src'
gcc -DHAVE_CONFIG_H -I. -I.. -I../lib -DCONFDIR=\"/usr/local/etc\" -DLOCALEDIR=\"/usr/local/share/locale\" -g -O2 -Wall -W -g -O2 -MT minicom.o -MD -MP -MF .deps/minicom.Tpo -c -o minicom.o minicom.c
minicom.c: In function ‘scrollback’:
minicom.c:472: warning: format not a string literal and no format arguments
minicom.c:525: warning: format not a string literal and no format arguments
minicom.c:734: warning: format not a string literal and no format arguments
minicom.c:754: warning: format not a string literal and no format arguments
minicom.c:773: warning: format not a string literal and no format arguments
minicom.c: In function ‘main’:
minicom.c:1553: warning: ignoring return value of ‘chown’, declared with attribute warn_unused_result
minicom.c: At top level:
minicom.c:31: warning: ‘_rcsid’ defined but not used
mv -f .deps/minicom.Tpo .deps/minicom.Po
gcc -DHAVE_CONFIG_H -I. -I.. -I../lib -DCONFDIR=\"/usr/local/etc\" -DLOCALEDIR=\"/usr/local/share/locale\" -g -O2 -Wall -W -g -O2 -MT vt100.o -MD -MP -MF .deps/vt100.Tpo -c -o vt100.o vt100.c
vt100.c:30: warning: ‘_rcsid’ defined but not used
mv -f .deps/vt100.Tpo .deps/vt100.Po
gcc -DHAVE_CONFIG_H -I. -I.. -I../lib -DCONFDIR=\"/usr/local/etc\" -DLOCALEDIR=\"/usr/local/share/locale\" -g -O2 -Wall -W -g -O2 -MT config.o -MD -MP -MF .deps/config.Tpo -c -o config.o config.c
config.c: In function ‘doconv’:
config.c:1759: warning: format not a string literal and no format arguments
config.c: In function ‘loadconv’:
config.c:1825: warning: ignoring return value of ‘fread’, declared with attribute warn_unused_result
config.c:1826: warning: ignoring return value of ‘fread’, declared with attribute warn_unused_result
config.c: At top level:
config.c:38: warning: ‘_rcsid’ defined but not used
mv -f .deps/config.Tpo .deps/config.Po
gcc -DHAVE_CONFIG_H -I. -I.. -I../lib -DCONFDIR=\"/usr/local/etc\" -DLOCALEDIR=\"/usr/local/share/locale\" -g -O2 -Wall -W -g -O2 -MT help.o -MD -MP -MF .deps/help.Tpo -c -o help.o help.c
help.c:24: warning: ‘_rcsid’ defined but not used
mv -f .deps/help.Tpo .deps/help.Po
gcc -DHAVE_CONFIG_H -I. -I.. -I../lib -DCONFDIR=\"/usr/local/etc\" -DLOCALEDIR=\"/usr/local/share/locale\" -g -O2 -Wall -W -g -O2 -MT updown.o -MD -MP -MF .deps/updown.Tpo -c -o updown.o updown.c
updown.c: In function ‘mcd’:
updown.c:57: warning: ignoring return value of ‘getcwd’, declared with attribute warn_unused_result
updown.c:61: warning: ignoring return value of ‘chdir’, declared with attribute warn_unused_result
updown.c: In function ‘updown’:
updown.c:251: warning: ignoring return value of ‘pipe’, declared with attribute warn_unused_result
updown.c: In function ‘kermit’:
updown.c:428: warning: ignoring return value of ‘chown’, declared with attribute warn_unused_result
updown.c:430: warning: ignoring return value of ‘write’, declared with attribute warn_unused_result
updown.c: In function ‘runscript’:
updown.c:593: warning: ignoring return value of ‘pipe’, declared with attribute warn_unused_result
updown.c: At top level:
updown.c:30: warning: ‘_rcsid’ defined but not used
mv -f .deps/updown.Tpo .deps/updown.Po
gcc -DHAVE_CONFIG_H -I. -I.. -I../lib -DCONFDIR=\"/usr/local/etc\" -DLOCALEDIR=\"/usr/local/share/locale\" -g -O2 -Wall -W -g -O2 -MT util.o -MD -MP -MF .deps/util.Tpo -c -o util.o util.c
util.c:24: warning: ‘_rcsid’ defined but not used
mv -f .deps/util.Tpo .deps/util.Po
gcc -DHAVE_CONFIG_H -I. -I.. -I../lib -DCONFDIR=\"/usr/local/etc\" -DLOCALEDIR=\"/usr/local/share/locale\" -g -O2 -Wall -W -g -O2 -MT dial.o -MD -MP -MF .deps/dial.Tpo -c -o dial.o dial.c
dial.c: In function ‘mputs’:
dial.c:235: warning: ignoring return value of ‘write’, declared with attribute warn_unused_result
dial.c: In function ‘v5_read’:
dial.c:747: warning: ignoring return value of ‘fread’, declared with attribute warn_unused_result
dial.c: In function ‘v4_read’:
dial.c:756: warning: ignoring return value of ‘fread’, declared with attribute warn_unused_result
dial.c: In function ‘v3_read’:
dial.c:775: warning: ignoring return value of ‘fread’, declared with attribute warn_unused_result
dial.c: In function ‘v2_read’:
dial.c:790: warning: ignoring return value of ‘fread’, declared with attribute warn_unused_result
dial.c: In function ‘v1_read’:
dial.c:806: warning: ignoring return value of ‘fread’, declared with attribute warn_unused_result
dial.c: In function ‘readdialdir’:
dial.c:880: warning: ignoring return value of ‘fread’, declared with attribute warn_unused_result
dial.c: At top level:
dial.c:37: warning: ‘_rcsid’ defined but not used
mv -f .deps/dial.Tpo .deps/dial.Po
gcc -DHAVE_CONFIG_H -I. -I.. -I../lib -DCONFDIR=\"/usr/local/etc\" -DLOCALEDIR=\"/usr/local/share/locale\" -g -O2 -Wall -W -g -O2 -MT window.o -MD -MP -MF .deps/window.Tpo -c -o window.o window.c
window.c:31:21: error: termcap.h: No such file or directory
window.c: In function ‘outstr’:
window.c:200: warning: implicit declaration of function ‘tputs’
window.c: In function ‘_gotoxy’:
window.c:301: warning: implicit declaration of function ‘tgoto’
window.c:301: warning: passing argument 1 of ‘outstr’ makes pointer from integer without a cast
window.c:309: warning: passing argument 1 of ‘outstr’ makes pointer from integer without a cast
window.c:345: error: ‘BC’ undeclared (first use in this function)
window.c:345: error: (Each undeclared identifier is reported only once
window.c:345: error: for each function it appears in.)
window.c:348: warning: passing argument 1 of ‘outstr’ makes pointer from integer without a cast
window.c: In function ‘mc_wscroll’:
window.c:851: warning: passing argument 1 of ‘outstr’ makes pointer from integer without a cast
window.c:862: warning: passing argument 1 of ‘outstr’ makes pointer from integer without a cast
window.c: In function ‘win_init’:
window.c:1949: warning: implicit declaration of function ‘tgetent’
window.c:1961: warning: implicit declaration of function ‘tgetstr’
window.c:1961: warning: assignment makes pointer from integer without a cast
window.c:1970: warning: implicit declaration of function ‘tgetnum’
window.c:1980: warning: assignment makes pointer from integer without a cast
window.c:1981: warning: assignment makes pointer from integer without a cast
window.c:1982: warning: assignment makes pointer from integer without a cast
window.c:1983: warning: assignment makes pointer from integer without a cast
window.c:1984: warning: assignment makes pointer from integer without a cast
window.c:1985: warning: assignment makes pointer from integer without a cast
window.c:1986: warning: assignment makes pointer from integer without a cast
window.c:1987: warning: assignment makes pointer from integer without a cast
window.c:1988: warning: assignment makes pointer from integer without a cast
window.c:1989: warning: assignment makes pointer from integer without a cast
window.c:1990: warning: assignment makes pointer from integer without a cast
window.c:1991: warning: assignment makes pointer from integer without a cast
window.c:1992: warning: assignment makes pointer from integer without a cast
window.c:1993: warning: assignment makes pointer from integer without a cast
window.c:1994: warning: assignment makes pointer from integer without a cast
window.c:1995: warning: assignment makes pointer from integer without a cast
window.c:1996: warning: assignment makes pointer from integer without a cast
window.c:1997: warning: assignment makes pointer from integer without a cast
window.c:1998: warning: assignment makes pointer from integer without a cast
window.c:1999: warning: assignment makes pointer from integer without a cast
window.c:2000: warning: assignment makes pointer from integer without a cast
window.c:2001: warning: assignment makes pointer from integer without a cast
window.c:2002: warning: assignment makes pointer from integer without a cast
window.c:2003: warning: assignment makes pointer from integer without a cast
window.c:2004: warning: assignment makes pointer from integer without a cast
window.c:2005: warning: assignment makes pointer from integer without a cast
window.c:2006: warning: assignment makes pointer from integer without a cast
window.c:2007: warning: assignment makes pointer from integer without a cast
window.c:2008: warning: assignment makes pointer from integer without a cast
window.c:2009: warning: assignment makes pointer from integer without a cast
window.c:2010: error: ‘BC’ undeclared (first use in this function)
window.c:2011: warning: assignment makes pointer from integer without a cast
window.c:2012: warning: assignment makes pointer from integer without a cast
window.c:2013: warning: assignment makes pointer from integer without a cast
window.c:2014: warning: assignment makes pointer from integer without a cast
window.c:2016: warning: assignment makes pointer from integer without a cast
window.c:2017: warning: assignment makes pointer from integer without a cast
window.c:2018: warning: assignment makes pointer from integer without a cast
window.c:2043: warning: implicit declaration of function ‘tgetflag’
make[2]: *** [window.o] Error 1
make[2]: Leaving directory `/home/ubuntu/Desktop/minicom-2.3/src'
make[1]: *** [all-recursive] Error 1
make[1]: Leaving directory `/home/ubuntu/Desktop/minicom-2.3'
make: *** [all] Error 2


页首
 用户资料  
 
4 楼 
 文章标题 : Re: com口工具minicom安装出错
帖子发表于 : 2009-11-01 14:43 

注册: 2008-11-17 12:46
帖子: 5
送出感谢: 0 次
接收感谢: 0 次
从昨晚高到现在 刚刚想提问 结果就找到答案了
在一个韩国有人哪里找到了
打开他那个网页都花了好几分钟
不过总算搞定

安装这两个包就行了 libncurses5 libncurses5-dev
:em06


页首
 用户资料  
 
5 楼 
 文章标题 : Re: com口工具minicom安装出错
帖子发表于 : 2015-06-29 17:33 

注册: 2015-06-29 17:28
帖子: 1
系统: ubuntu14.10
送出感谢: 0 次
接收感谢: 0 次
遇到同样的问题,看到你给出的方法。唯有谢谢二字。


页首
 用户资料  
 
显示帖子 :  排序  
发表新帖 回复这个主题  [ 5 篇帖子 ] 

当前时区为 UTC + 8 小时


在线用户

正在浏览此版面的用户:没有注册用户 和 4 位游客


不能 在这个版面发表主题
不能 在这个版面回复主题
不能 在这个版面编辑帖子
不能 在这个版面删除帖子
不能 在这个版面提交附件

前往 :  
本站点为公益性站点,用于推广开源自由软件,由 DiaHosting VPSBudgetVM VPS 提供服务。
我们认为:软件应可免费取得,软件工具在各种语言环境下皆可使用,且不会有任何功能上的差异;
人们应有定制和修改软件的自由,且方式不受限制,只要他们自认为合适。

Powered by phpBB © 2000, 2002, 2005, 2007 phpBB Group
简体中文语系由 王笑宇 翻译