当前时区为 UTC + 8 小时



发表新帖 回复这个主题  [ 7 篇帖子 ] 
作者 内容
1 楼 
 文章标题 : [问题]急求:安装DR.COM出现问题,望各位大虾帮忙。
帖子发表于 : 2008-08-29 9:35 

注册: 2008-08-24 7:37
帖子: 37
送出感谢: 0 次
接收感谢: 0 次
错误: stdio.h:没有该文件或目录
drcomc.c:2:20: 错误: string.h:没有该文件或目录
drcomc.c:3:20: 错误: stdlib.h:没有该文件或目录
drcomc.c:4:20: 错误: unistd.h:没有该文件或目录
drcomc.c:5:23: 错误: sys/types.h:没有该文件或目录
drcomc.c:6:24: 错误: sys/socket.h:没有该文件或目录
drcomc.c:7:20: 错误: sys/un.h:没有该文件或目录
在包含自 drcomc.c:9 的文件中:
../include/client_daemon.h:4:20: 错误: stdint.h:没有该文件或目录
In file included from drcomc.c:9:
../include/client_daemon.h:13: 错误: expected specifier-qualifier-list before ‘uint16_t’
../include/client_daemon.h:54: 错误: expected ‘=’, ‘,’, ‘;’, ‘asm’ or ‘__attribute__’ before ‘safe_recv’
../include/client_daemon.h:55: 错误: expected ‘=’, ‘,’, ‘;’, ‘asm’ or ‘__attribute__’ before ‘safe_send’
In file included from drcomc.c:10:
../include/utils.h:4: 错误: expected ‘=’, ‘,’, ‘;’, ‘asm’ or ‘__attribute__’ before ‘safe_send’
../include/utils.h:5: 错误: expected ‘=’, ‘,’, ‘;’, ‘asm’ or ‘__attribute__’ before ‘safe_recv’
../include/utils.h:6: 错误: expected declaration specifiers or ‘...’ before ‘u_int32_t’
drcomc.c: 在函数‘usage’中:
drcomc.c:17: 警告: 隐式声明函数‘puts’
drcomc.c: 在文件层:
drcomc.c:21: 错误: expected declaration specifiers or ‘...’ before ‘uint16_t’
drcomc.c: 在函数‘send_command’中:
drcomc.c:31: 错误: ‘ssize_t’未声明 (在此函数内第一次使用)
drcomc.c:31: 错误: (即使在一个函数内多次出现,每个未声明的标识符在其
drcomc.c:31: 错误: 所在的函数内也只报告一次。)
drcomc.c:31: 错误: expected ‘;’ before ‘r’
drcomc.c:33: 错误: ‘command’未声明 (在此函数内第一次使用)
drcomc.c:48: 警告: 隐式声明函数‘strlen’
drcomc.c:48: 警告: 内建函数 ‘strlen’ 不兼容的隐式声明
drcomc.c:51: 警告: 隐式声明函数‘printf’
drcomc.c:51: 警告: 内建函数 ‘printf’ 不兼容的隐式声明
drcomc.c:55: 警告: 隐式声明函数‘memset’
drcomc.c:55: 警告: 内建函数 ‘memset’ 不兼容的隐式声明
drcomc.c:56: 警告: 隐式声明函数‘strncpy’
drcomc.c:56: 警告: 内建函数 ‘strncpy’ 不兼容的隐式声明
drcomc.c:63: 警告: 内建函数 ‘printf’ 不兼容的隐式声明
drcomc.c:67: 错误: ‘struct drcomcd_hdr’没有名为‘signature’的成员
drcomc.c:68: 错误: ‘struct drcomcd_hdr’没有名为‘type’的成员
drcomc.c:70: 错误: ‘r’未声明 (在此函数内第一次使用)
drcomc.c:70: 警告: 隐式声明函数‘safe_send’
drcomc.c: 在函数‘recv_acknowledge’中:
drcomc.c:84: 错误: ‘ssize_t’未声明 (在此函数内第一次使用)
drcomc.c:84: 错误: expected ‘;’ before ‘r’
drcomc.c:88: 错误: ‘r’未声明 (在此函数内第一次使用)
drcomc.c:88: 警告: 隐式声明函数‘safe_recv’
drcomc.c:92: 错误: ‘struct drcomcd_hdr’没有名为‘signature’的成员
drcomc.c:93: 警告: 内建函数 ‘printf’ 不兼容的隐式声明
drcomc.c:97: 错误: ‘struct drcomcd_hdr’没有名为‘msg_len’的成员
drcomc.c:100: 警告: 隐式声明函数‘malloc’
drcomc.c:100: 警告: 内建函数 ‘malloc’ 不兼容的隐式声明
drcomc.c:100: 错误: ‘struct drcomcd_hdr’没有名为‘msg_len’的成员
drcomc.c:101: 错误: ‘NULL’未声明 (在此函数内第一次使用)
drcomc.c:102: 警告: 内建函数 ‘printf’ 不兼容的隐式声明
drcomc.c:106: 错误: ‘struct drcomcd_hdr’没有名为‘msg_len’的成员
drcomc.c:107: 错误: ‘struct drcomcd_hdr’没有名为‘msg_len’的成员
drcomc.c:108: 警告: 内建函数 ‘printf’ 不兼容的隐式声明
drcomc.c:112: 错误: ‘struct drcomcd_hdr’没有名为‘msg_len’的成员
drcomc.c:114: 警告: 内建函数 ‘printf’ 不兼容的隐式声明
drcomc.c:116: 警告: 隐式声明函数‘free’
drcomc.c:117: 错误: ‘struct drcomcd_hdr’没有名为‘is_end’的成员
drcomc.c:120: 错误: ‘struct drcomcd_hdr’没有名为‘type’的成员
drcomc.c: 在函数‘init_socket’中:
drcomc.c:129: 错误: ‘un_daemon’的存储大小未知
drcomc.c:131: 警告: 内建函数 ‘memset’ 不兼容的隐式声明
drcomc.c:131: 错误: ‘sizeof’不能用于不完全的类型‘struct sockaddr_un’
drcomc.c:132: 错误: ‘AF_UNIX’未声明 (在此函数内第一次使用)
drcomc.c:134: 警告: 内建函数 ‘strncpy’ 不兼容的隐式声明
drcomc.c:136: 警告: 隐式声明函数‘socket’
drcomc.c:136: 错误: ‘PF_UNIX’未声明 (在此函数内第一次使用)
drcomc.c:136: 错误: ‘SOCK_STREAM’未声明 (在此函数内第一次使用)
drcomc.c:138: 警告: 隐式声明函数‘perror’
drcomc.c:142: 警告: 隐式声明函数‘connect’
drcomc.c:129: 警告: 未使用的变量‘un_daemon’
drcomc.c: 在函数‘main’中:
drcomc.c:154: 错误: ‘uint16_t’未声明 (在此函数内第一次使用)
drcomc.c:154: 错误: expected ‘;’ before ‘command’
drcomc.c:155: 错误: ‘NULL’未声明 (在此函数内第一次使用)
drcomc.c:161: 警告: 隐式声明函数‘strcmp’
drcomc.c:162: 错误: ‘command’未声明 (在此函数内第一次使用)
drcomc.c:170: 警告: 隐式声明函数‘exit’
drcomc.c:170: 警告: 内建函数 ‘exit’ 不兼容的隐式声明
drcomc.c:175: 警告: 内建函数 ‘exit’ 不兼容的隐式声明
drcomc.c:177: 错误: 提供给函数‘send_command’的实参太多
drcomc.c:181: 警告: 内建函数 ‘printf’ 不兼容的隐式声明
drcomc.c:186: 警告: 隐式声明函数‘close’
make[1]: *** [drcomc.o] 错误 1
make[1]: Leaving directory `/home/maxp88/桌面/drcom-1.4.7/drcomc'
make: *** [all] 错误 1
maxp88@maxp88-laptop:~/桌面/drcom-1.4.7$ cd /home/maxp88/桌面/drcom-1.4.7
maxp88@maxp88-laptop:~/桌面/drcom-1.4.7$ make
make[1]: Entering directory `/home/maxp88/桌面/drcom-1.4.7/drcomc'
CC drcomc.c
drcomc.c:1:19: 错误: stdio.h:没有该文件或目录
drcomc.c:2:20: 错误: string.h:没有该文件或目录
drcomc.c:3:20: 错误: stdlib.h:没有该文件或目录
drcomc.c:4:20: 错误: unistd.h:没有该文件或目录
drcomc.c:5:23: 错误: sys/types.h:没有该文件或目录
drcomc.c:6:24: 错误: sys/socket.h:没有该文件或目录
drcomc.c:7:20: 错误: sys/un.h:没有该文件或目录
在包含自 drcomc.c:9 的文件中:
../include/client_daemon.h:4:20: 错误: stdint.h:没有该文件或目录
In file included from drcomc.c:9:
../include/client_daemon.h:13: 错误: expected specifier-qualifier-list before ‘uint16_t’
../include/client_daemon.h:54: 错误: expected ‘=’, ‘,’, ‘;’, ‘asm’ or ‘__attribute__’ before ‘safe_recv’
../include/client_daemon.h:55: 错误: expected ‘=’, ‘,’, ‘;’, ‘asm’ or ‘__attribute__’ before ‘safe_send’
In file included from drcomc.c:10:
../include/utils.h:4: 错误: expected ‘=’, ‘,’, ‘;’, ‘asm’ or ‘__attribute__’ before ‘safe_send’
../include/utils.h:5: 错误: expected ‘=’, ‘,’, ‘;’, ‘asm’ or ‘__attribute__’ before ‘safe_recv’
../include/utils.h:6: 错误: expected declaration specifiers or ‘...’ before ‘u_int32_t’
drcomc.c: 在函数‘usage’中:
drcomc.c:17: 警告: 隐式声明函数‘puts’
drcomc.c: 在文件层:
drcomc.c:21: 错误: expected declaration specifiers or ‘...’ before ‘uint16_t’
drcomc.c: 在函数‘send_command’中:
drcomc.c:31: 错误: ‘ssize_t’未声明 (在此函数内第一次使用)
drcomc.c:31: 错误: (即使在一个函数内多次出现,每个未声明的标识符在其
drcomc.c:31: 错误: 所在的函数内也只报告一次。)
drcomc.c:31: 错误: expected ‘;’ before ‘r’
drcomc.c:33: 错误: ‘command’未声明 (在此函数内第一次使用)
drcomc.c:48: 警告: 隐式声明函数‘strlen’
drcomc.c:48: 警告: 内建函数 ‘strlen’ 不兼容的隐式声明
drcomc.c:51: 警告: 隐式声明函数‘printf’
drcomc.c:51: 警告: 内建函数 ‘printf’ 不兼容的隐式声明
drcomc.c:55: 警告: 隐式声明函数‘memset’
drcomc.c:55: 警告: 内建函数 ‘memset’ 不兼容的隐式声明
drcomc.c:56: 警告: 隐式声明函数‘strncpy’
drcomc.c:56: 警告: 内建函数 ‘strncpy’ 不兼容的隐式声明
drcomc.c:63: 警告: 内建函数 ‘printf’ 不兼容的隐式声明
drcomc.c:67: 错误: ‘struct drcomcd_hdr’没有名为‘signature’的成员
drcomc.c:68: 错误: ‘struct drcomcd_hdr’没有名为‘type’的成员
drcomc.c:70: 错误: ‘r’未声明 (在此函数内第一次使用)
drcomc.c:70: 警告: 隐式声明函数‘safe_send’
drcomc.c: 在函数‘recv_acknowledge’中:
drcomc.c:84: 错误: ‘ssize_t’未声明 (在此函数内第一次使用)
drcomc.c:84: 错误: expected ‘;’ before ‘r’
drcomc.c:88: 错误: ‘r’未声明 (在此函数内第一次使用)
drcomc.c:88: 警告: 隐式声明函数‘safe_recv’
drcomc.c:92: 错误: ‘struct drcomcd_hdr’没有名为‘signature’的成员
drcomc.c:93: 警告: 内建函数 ‘printf’ 不兼容的隐式声明
drcomc.c:97: 错误: ‘struct drcomcd_hdr’没有名为‘msg_len’的成员
drcomc.c:100: 警告: 隐式声明函数‘malloc’
drcomc.c:100: 警告: 内建函数 ‘malloc’ 不兼容的隐式声明
drcomc.c:100: 错误: ‘struct drcomcd_hdr’没有名为‘msg_len’的成员
drcomc.c:101: 错误: ‘NULL’未声明 (在此函数内第一次使用)
drcomc.c:102: 警告: 内建函数 ‘printf’ 不兼容的隐式声明
drcomc.c:106: 错误: ‘struct drcomcd_hdr’没有名为‘msg_len’的成员
drcomc.c:107: 错误: ‘struct drcomcd_hdr’没有名为‘msg_len’的成员
drcomc.c:108: 警告: 内建函数 ‘printf’ 不兼容的隐式声明
drcomc.c:112: 错误: ‘struct drcomcd_hdr’没有名为‘msg_len’的成员
drcomc.c:114: 警告: 内建函数 ‘printf’ 不兼容的隐式声明
drcomc.c:116: 警告: 隐式声明函数‘free’
drcomc.c:117: 错误: ‘struct drcomcd_hdr’没有名为‘is_end’的成员
drcomc.c:120: 错误: ‘struct drcomcd_hdr’没有名为‘type’的成员
drcomc.c: 在函数‘init_socket’中:
drcomc.c:129: 错误: ‘un_daemon’的存储大小未知
drcomc.c:131: 警告: 内建函数 ‘memset’ 不兼容的隐式声明
drcomc.c:131: 错误: ‘sizeof’不能用于不完全的类型‘struct sockaddr_un’
drcomc.c:132: 错误: ‘AF_UNIX’未声明 (在此函数内第一次使用)
drcomc.c:134: 警告: 内建函数 ‘strncpy’ 不兼容的隐式声明
drcomc.c:136: 警告: 隐式声明函数‘socket’
drcomc.c:136: 错误: ‘PF_UNIX’未声明 (在此函数内第一次使用)
drcomc.c:136: 错误: ‘SOCK_STREAM’未声明 (在此函数内第一次使用)
drcomc.c:138: 警告: 隐式声明函数‘perror’
drcomc.c:142: 警告: 隐式声明函数‘connect’
drcomc.c:129: 警告: 未使用的变量‘un_daemon’
drcomc.c: 在函数‘main’中:
drcomc.c:154: 错误: ‘uint16_t’未声明 (在此函数内第一次使用)
drcomc.c:154: 错误: expected ‘;’ before ‘command’
drcomc.c:155: 错误: ‘NULL’未声明 (在此函数内第一次使用)
drcomc.c:161: 警告: 隐式声明函数‘strcmp’
drcomc.c:162: 错误: ‘command’未声明 (在此函数内第一次使用)
drcomc.c:170: 警告: 隐式声明函数‘exit’
drcomc.c:170: 警告: 内建函数 ‘exit’ 不兼容的隐式声明
drcomc.c:175: 警告: 内建函数 ‘exit’ 不兼容的隐式声明
drcomc.c:177: 错误: 提供给函数‘send_command’的实参太多
drcomc.c:181: 警告: 内建函数 ‘printf’ 不兼容的隐式声明
drcomc.c:186: 警告: 隐式声明函数‘close’
make[1]: *** [drcomc.o] 错误 1
make[1]: Leaving directory `/home/maxp88/桌面/drcom-1.4.7/drcomc'
make: *** [all] 错误 1
maxp88@maxp88-laptop:~/桌面/drcom-1.4.7$


页首
 用户资料  
 
2 楼 
 文章标题 :
帖子发表于 : 2008-08-29 9:39 
头像

注册: 2007-10-06 18:40
帖子: 4313
送出感谢: 0 次
接收感谢: 5
http://forum.ubuntu.org.cn/viewtopic.php?t=113065


_________________
E=m c^2


页首
 用户资料  
 
3 楼 
 文章标题 :
帖子发表于 : 2008-08-29 10:36 

注册: 2008-08-24 7:37
帖子: 37
送出感谢: 0 次
接收感谢: 0 次
多谢楼上。那个帖子我已经看过了,也试过了。但是我的问题依然存在。


页首
 用户资料  
 
4 楼 
 文章标题 :
帖子发表于 : 2008-08-29 10:49 
头像

注册: 2008-07-30 23:21
帖子: 13223
地址: freebuilder@yeah.net
系统: Debian stable AMD64
送出感谢: 36
接收感谢: 121
:em34
怎么又有人报缺 stdio.h
居然还带上 stdlib.h string.h ...
我只能说,系统有问题了


页首
 用户资料  
 
5 楼 
 文章标题 :
帖子发表于 : 2008-08-29 11:25 

注册: 2008-08-24 7:37
帖子: 37
送出感谢: 0 次
接收感谢: 0 次
用sudo apt-get install build-essential 时提示
"现在没有可用的软件包 build-essential"

这是怎么回事啊?


页首
 用户资料  
 
6 楼 
 文章标题 :
帖子发表于 : 2008-08-29 11:56 
头像

注册: 2008-04-02 15:36
帖子: 724
地址: O_O
送出感谢: 0 次
接收感谢: 0 次
你的源有问题


_________________
^o^ && O_O && ^_^
One World|One Dream|One Piece
愛 ^_^ 這個 美麗的世界O_O

本公司专治各种不服、不爽、谩骂、挑衅。


页首
 用户资料  
 
7 楼 
 文章标题 :
帖子发表于 : 2008-08-29 12:07 
头像

注册: 2007-10-06 18:40
帖子: 4313
送出感谢: 0 次
接收感谢: 5
maxp88 写道:
用sudo apt-get install build-essential 时提示
"现在没有可用的软件包 build-essential"

这是怎么回事啊?

插入ubuntu cd。
sudo apt-cdrom add
sudo apt-get install build-essential


_________________
E=m c^2


页首
 用户资料  
 
显示帖子 :  排序  
发表新帖 回复这个主题  [ 7 篇帖子 ] 

当前时区为 UTC + 8 小时


在线用户

正在浏览此版面的用户:没有注册用户 和 4 位游客


不能 在这个版面发表主题
不能 在这个版面回复主题
不能 在这个版面编辑帖子
不能 在这个版面删除帖子
不能 在这个版面提交附件

前往 :  
本站点为公益性站点,用于推广开源自由软件,由 DiaHosting VPSBudgetVM VPS 提供服务。
我们认为:软件应可免费取得,软件工具在各种语言环境下皆可使用,且不会有任何功能上的差异;
人们应有定制和修改软件的自由,且方式不受限制,只要他们自认为合适。

Powered by phpBB © 2000, 2002, 2005, 2007 phpBB Group
简体中文语系由 王笑宇 翻译