当前时区为 UTC + 8 小时



发表新帖 回复这个主题  [ 5 篇帖子 ] 
作者 内容
1 楼 
 文章标题 : 内核编译出现问题
帖子发表于 : 2008-09-30 9:43 

注册: 2008-09-14 0:20
帖子: 20
送出感谢: 0 次
接收感谢: 0 次
我的系统是xubuntu,内核版本是linux-headers-2.6.24-19-generic,当我在安装一个文件的时候出现以下error:请大侠帮帮忙看看怎么解决。

目前我自己的认识是:出现这个问题的原因是因为2.6的内核相对于2.4的内核有一些发生了改变,例如在2.6内核开发中,在
linux/module.h定义的宏MODULE_PARM都要用在linux/moduleparam.h定义的宏module_param或另一个(略)来
实现,而这2个宏的参数也发生了变化,我在尝试修改部分宏的时候修改成功,但是还有部分不知道怎么转换相应参数,我的理解是
我要编译的这个文件是基于2.4的内核写的,而我的内核是2.6的,所以会出现这么多的问题,如果我把文件换成基于2.6版本的应该
就可能可以解决,或者把我的系统内核降成2.4版本的,也许也可以解决,但是问题在于我没有基于2.6版本的文件,其次我不知道
怎么把内核版本降为2.4版本。

以上是我自己对error的一些理解,所以请大家给点参考意见,可直接回复,也可以发到我邮箱zefei.zhang@hotmail.com,谢谢。

下面是编译时出现的error log:
#####################################
error log:
surfer@surfer-desktop:~/software/aksparlnx-1.6-x86$ sudo ./build.sh --install
make -C /lib/modules/2.6.24-19-generic/build here=$(pwd)/ SUBDIRS=$(pwd) modules
make[1]: 正在进入目录 `/usr/src/linux-headers-2.6.24-19-generic'
CC [M] /home/surfer/software/aksparlnx-1.6-x86/aksparpub.o
/home/surfer/software/aksparlnx-1.6-x86/aksparpub.c:90: 错误: expected ‘)’ before string constant
/home/surfer/software/aksparlnx-1.6-x86/aksparpub.c:91: 错误: expected ‘)’ before string constant
/home/surfer/software/aksparlnx-1.6-x86/aksparpub.c:92: 错误: expected ‘)’ before string constant
/home/surfer/software/aksparlnx-1.6-x86/aksparpub.c: 在函数‘hl_api_ioctl’中:
/home/surfer/software/aksparlnx-1.6-x86/aksparpub.c:149: 错误: 隐式声明函数‘verify_area’
/home/surfer/software/aksparlnx-1.6-x86/aksparpub.c: 在文件层:
/home/surfer/software/aksparlnx-1.6-x86/aksparpub.c:378: 错误: expected ‘)’ before string constant
/home/surfer/software/aksparlnx-1.6-x86/aksparpub.c:379: 错误: expected ‘)’ before string constant
/home/surfer/software/aksparlnx-1.6-x86/aksparpub.c:382: 错误: expected ‘)’ before string constant
/home/surfer/software/aksparlnx-1.6-x86/aksparpub.c: 在函数‘hl_init_module’中:
/home/surfer/software/aksparlnx-1.6-x86/aksparpub.c:479: 错误: ‘PCI_DEVICE_ID_AKS_CPC’未声明 (在此函数内第一次使用)
/home/surfer/software/aksparlnx-1.6-x86/aksparpub.c:479: 错误: (即使在一个函数内多次出现,每个未声明的标识符在其
/home/surfer/software/aksparlnx-1.6-x86/aksparpub.c:479: 错误: 所在的函数内也只报告一次。)
make[2]: *** [/home/surfer/software/aksparlnx-1.6-x86/aksparpub.o] 错误 1
make[1]: *** [_module_/home/surfer/software/aksparlnx-1.6-x86] 错误 2
make[1]:正在离开目录 `/usr/src/linux-headers-2.6.24-19-generic'
make: *** [kernel26] 错误 2
aksparlnx.ko does not exist!
aborting
#######################################


页首
 用户资料  
 
2 楼 
 文章标题 : Re: 内核编译出现问题
帖子发表于 : 2008-09-30 23:43 

注册: 2008-09-14 0:20
帖子: 20
送出感谢: 0 次
接收感谢: 0 次
没人知道吗?

还是我写的不够具体????????


页首
 用户资料  
 
3 楼 
 文章标题 : Re: 内核编译出现问题
帖子发表于 : 2008-10-02 23:29 
头像

注册: 2008-07-14 22:42
帖子: 8078
地址: Beijing
送出感谢: 0 次
接收感谢: 0 次
内核编译还是不是很会。。。失败过几次了 :em06 似乎有点复杂


_________________
Ubuntu User


页首
 用户资料  
 
4 楼 
 文章标题 : Re: 内核编译出现问题
帖子发表于 : 2008-10-02 23:33 
头像

注册: 2007-09-29 3:09
帖子: 5773
送出感谢: 0 次
接收感谢: 3
非要2.4的内核还是去下载一个编译吧

http://www.kernel.org/

2.4.36啊


_________________
HUNT Unfortunately No Talent...


页首
 用户资料  
 
5 楼 
 文章标题 : Re: 内核编译出现问题
帖子发表于 : 2009-11-30 22:26 

注册: 2009-07-06 20:32
帖子: 4
送出感谢: 0 次
接收感谢: 0 次
请问,楼主最后怎么解决的啊?我也遇到这个问题了。


页首
 用户资料  
 
显示帖子 :  排序  
发表新帖 回复这个主题  [ 5 篇帖子 ] 

当前时区为 UTC + 8 小时


在线用户

正在浏览此版面的用户:没有注册用户 和 4 位游客


不能 在这个版面发表主题
不能 在这个版面回复主题
不能 在这个版面编辑帖子
不能 在这个版面删除帖子
不能 在这个版面提交附件

前往 :  
本站点为公益性站点,用于推广开源自由软件,由 DiaHosting VPSBudgetVM VPS 提供服务。
我们认为:软件应可免费取得,软件工具在各种语言环境下皆可使用,且不会有任何功能上的差异;
人们应有定制和修改软件的自由,且方式不受限制,只要他们自认为合适。

Powered by phpBB © 2000, 2002, 2005, 2007 phpBB Group
简体中文语系由 王笑宇 翻译