编译内核时的错误提示,请教高手!

编译安装或者制作Deb包
回复
独孤一梦
帖子: 76
注册时间: 2008-01-07 14:14
送出感谢: 0
接收感谢: 0

编译内核时的错误提示,请教高手!

#1

帖子 独孤一梦 » 2008-11-11 11:46

kernel/sched.c:4071: 错误: ‘task_utime’重定义
kernel/sched.c:4012: 错误: ‘task_utime’的上一个定义在此
kernel/sched.c:4092: 错误: ‘task_stime’重定义
kernel/sched.c:4033: 错误: ‘task_stime’的上一个定义在此
kernel/sched.c:4111: 错误: ‘task_gtime’重定义
kernel/sched.c:4052: 错误: ‘task_gtime’的上一个定义在此
kernel/sched.c:4130: 错误: ‘task_utime’重定义
kernel/sched.c:4012: 错误: ‘task_utime’的上一个定义在此
kernel/sched.c:4151: 错误: ‘task_stime’重定义
kernel/sched.c:4033: 错误: ‘task_stime’的上一个定义在此
kernel/sched.c:4170: 错误: ‘task_gtime’重定义
kernel/sched.c:4052: 错误: ‘task_gtime’的上一个定义在此
make[2]: *** [kernel/sched.o] 错误 1
make[1]: *** [kernel] 错误 2
make[1]:正在离开目录 `/home/hua/linux/linux-2.6.26.8'
make: *** [debian/stamp-build-kernel] 错误 2
回复

回到 “编译或打包”