当前时区为 UTC + 8 小时



发表新帖 回复这个主题  [ 5 篇帖子 ] 
作者 内容
1 楼 
 文章标题 : 安装gmp4.2.1中遇到如下问题,望大虾解决。
帖子发表于 : 2009-01-05 14:24 
头像

注册: 2008-12-22 12:24
帖子: 18
送出感谢: 0 次
接收感谢: 0 次
代码:
[size=200][size=150][b]首先贴出:make check 的一段代码:[/b][/size][/size]


ke[4]: “t-sqrtrem”是最新的。
make[4]: “convert”是最新的。
make[4]: “io”是最新的。
make[4]: “t-inp_str”是最新的。
make[4]: “logic”是最新的。
make[4]: “bit”是最新的。
make[4]: “t-powm”是最新的。
make[4]: “t-powm_ui”是最新的。
make[4]: “t-pow”是最新的。
make[4]: “t-div_2exp”是最新的。
make[4]: “reuse”是最新的。
make[4]: “t-root”是最新的。
make[4]: “t-perfsqr”是最新的。
make[4]: “t-jac”是最新的。
make[4]: “t-bin”是最新的。
make[4]: “t-get_d”是最新的。
make[4]: “t-get_d_2exp”是最新的。
make[4]: “t-get_si”是最新的。
make[4]: “t-set_d”是最新的。
make[4]: “t-set_si”是最新的。
make[4]: “t-fac_ui”是最新的。
make[4]: “t-fib_ui”是最新的。
make[4]: “t-lucnum_ui”是最新的。
make[4]: “t-scan”是最新的。
make[4]: “t-fits”是最新的。
make[4]: “t-divis”是最新的。
make[4]: “t-divis_2exp”是最新的。
make[4]: “t-cong”是最新的。
make[4]: “t-cong_2exp”是最新的。
make[4]: “t-sizeinbase”是最新的。
make[4]: “t-set_str”是最新的。
make[4]: “t-aorsmul”是最新的。
make[4]: “t-cmp_d”是最新的。
make[4]: “t-cmp_si”是最新的。
make[4]: “t-hamdist”是最新的。
make[4]: “t-oddeven”是最新的。
make[4]: “t-popcount”是最新的。
make[4]: “t-set_f”是最新的。
make[4]: “t-io_raw”是最新的。
make[4]: “t-import”是最新的。
make[4]: “t-export”是最新的。
make[4]: “t-pprime_p”是最新的。
make[4]:正在离开目录 `/home/zhu/armlinux/build-tools/gmp-4.2.1/tests/mpz'
make check-TESTS
make[4]: 正在进入目录 `/home/zhu/armlinux/build-tools/gmp-4.2.1/tests/mpz'
PASS: t-addsub
PASS: t-cmp
PASS: t-mul
PASS: t-mul_i
PASS: t-tdiv
PASS: t-tdiv_ui
PASS: t-fdiv
PASS: t-fdiv_ui
PASS: t-cdiv_ui
PASS: t-gcd
PASS: t-gcd_ui
PASS: t-lcm
PASS: dive
PASS: dive_ui
PASS: t-sqrtrem
PASS: convert
PASS: io
PASS: t-inp_str
PASS: logic
PASS: bit
PASS: t-powm
PASS: t-powm_ui
PASS: t-pow
PASS: t-div_2exp
PASS: reuse
PASS: t-root
PASS: t-perfsqr
PASS: t-jac
PASS: t-bin
PASS: t-get_d
PASS: t-get_d_2exp
PASS: t-get_si
PASS: t-set_d
PASS: t-set_si
PASS: t-fac_ui
PASS: t-fib_ui
PASS: t-lucnum_ui
PASS: t-scan
PASS: t-fits
PASS: t-divis
PASS: t-divis_2exp
PASS: t-cong
PASS: t-cong_2exp
PASS: t-sizeinbase
PASS: t-set_str
PASS: t-aorsmul
PASS: t-cmp_d
PASS: t-cmp_si
PASS: t-hamdist
PASS: t-oddeven
PASS: t-popcount
PASS: t-set_f
PASS: t-io_raw
PASS: t-import
PASS: t-export
PASS: t-pprime_p
===================
All 56 tests passed
===================
make[4]:正在离开目录 `/home/zhu/armlinux/build-tools/gmp-4.2.1/tests/mpz'
make[3]:正在离开目录 `/home/zhu/armlinux/build-tools/gmp-4.2.1/tests/mpz'
Making check in mpq
make[3]: 正在进入目录 `/home/zhu/armlinux/build-tools/gmp-4.2.1/tests/mpq'
make t-aors t-cmp t-cmp_ui t-cmp_si t-equal t-get_d t-get_str t-inp_str t-md_2exp t-set_f t-set_str
make[4]: 正在进入目录 `/home/zhu/armlinux/build-tools/gmp-4.2.1/tests/mpq'
make[4]: “t-aors”是最新的。
make[4]: “t-cmp”是最新的。
make[4]: “t-cmp_ui”是最新的。
make[4]: “t-cmp_si”是最新的。
make[4]: “t-equal”是最新的。
make[4]: “t-get_d”是最新的。
make[4]: “t-get_str”是最新的。
make[4]: “t-inp_str”是最新的。
make[4]: “t-md_2exp”是最新的。
make[4]: “t-set_f”是最新的。
make[4]: “t-set_str”是最新的。
make[4]:正在离开目录 `/home/zhu/armlinux/build-tools/gmp-4.2.1/tests/mpq'
make check-TESTS
make[4]: 正在进入目录 `/home/zhu/armlinux/build-tools/gmp-4.2.1/tests/mpq'
PASS: t-aors
PASS: t-cmp
PASS: t-cmp_ui
PASS: t-cmp_si
PASS: t-equal
PASS: t-get_d
PASS: t-get_str
PASS: t-inp_str
PASS: t-md_2exp
PASS: t-set_f
PASS: t-set_str
===================
All 11 tests passed
===================
make[4]:正在离开目录 `/home/zhu/armlinux/build-tools/gmp-4.2.1/tests/mpq'
make[3]:正在离开目录 `/home/zhu/armlinux/build-tools/gmp-4.2.1/tests/mpq'
Making check in mpf
make[3]: 正在进入目录 `/home/zhu/armlinux/build-tools/gmp-4.2.1/tests/mpf'
make t-add t-sub t-conv t-sqrt t-sqrt_ui t-muldiv t-dm2exp reuse t-cmp_d t-cmp_si t-div t-fits t-get_d t-get_d_2exp t-get_si t-get_ui t-gsprec t-inp_str t-int_p t-mul_ui t-set t-set_q t-set_si t-set_ui t-trunc t-ui_div
make[4]: 正在进入目录 `/home/zhu/armlinux/build-tools/gmp-4.2.1/tests/mpf'
make[4]: “t-add”是最新的。
make[4]: “t-sub”是最新的。
make[4]: “t-conv”是最新的。
make[4]: “t-sqrt”是最新的。
make[4]: “t-sqrt_ui”是最新的。
make[4]: “t-muldiv”是最新的。
make[4]: “t-dm2exp”是最新的。
make[4]: “reuse”是最新的。
make[4]: “t-cmp_d”是最新的。
make[4]: “t-cmp_si”是最新的。
make[4]: “t-div”是最新的。
make[4]: “t-fits”是最新的。
make[4]: “t-get_d”是最新的。
make[4]: “t-get_d_2exp”是最新的。
make[4]: “t-get_si”是最新的。
make[4]: “t-get_ui”是最新的。
make[4]: “t-gsprec”是最新的。
make[4]: “t-inp_str”是最新的。
make[4]: “t-int_p”是最新的。
make[4]: “t-mul_ui”是最新的。
make[4]: “t-set”是最新的。
make[4]: “t-set_q”是最新的。
make[4]: “t-set_si”是最新的。
make[4]: “t-set_ui”是最新的。
make[4]: “t-trunc”是最新的。
make[4]: “t-ui_div”是最新的。
make[4]:正在离开目录 `/home/zhu/armlinux/build-tools/gmp-4.2.1/tests/mpf'
make check-TESTS
make[4]: 正在进入目录 `/home/zhu/armlinux/build-tools/gmp-4.2.1/tests/mpf'
PASS: t-add
PASS: t-sub
PASS: t-conv
PASS: t-sqrt
PASS: t-sqrt_ui
PASS: t-muldiv
PASS: t-dm2exp
PASS: reuse
PASS: t-cmp_d
PASS: t-cmp_si
PASS: t-div
PASS: t-fits
PASS: t-get_d
PASS: t-get_d_2exp
PASS: t-get_si
PASS: t-get_ui
PASS: t-gsprec
PASS: t-inp_str
PASS: t-int_p
PASS: t-mul_ui
PASS: t-set
PASS: t-set_q
PASS: t-set_si
PASS: t-set_ui
PASS: t-trunc
PASS: t-ui_div
===================
All 26 tests passed
===================
make[4]:正在离开目录 `/home/zhu/armlinux/build-tools/gmp-4.2.1/tests/mpf'
make[3]:正在离开目录 `/home/zhu/armlinux/build-tools/gmp-4.2.1/tests/mpf'
Making check in rand
make[3]: 正在进入目录 `/home/zhu/armlinux/build-tools/gmp-4.2.1/tests/rand'
make t-iset t-lc2exp t-mt t-rand t-urbui t-urmui t-urndmm
make[4]: 正在进入目录 `/home/zhu/armlinux/build-tools/gmp-4.2.1/tests/rand'
make[4]: “t-iset”是最新的。
make[4]: “t-lc2exp”是最新的。
make[4]: “t-mt”是最新的。
make[4]: “t-rand”是最新的。
make[4]: “t-urbui”是最新的。
make[4]: “t-urmui”是最新的。
make[4]: “t-urndmm”是最新的。
make[4]:正在离开目录 `/home/zhu/armlinux/build-tools/gmp-4.2.1/tests/rand'
make check-TESTS
make[4]: 正在进入目录 `/home/zhu/armlinux/build-tools/gmp-4.2.1/tests/rand'
PASS: t-iset
PASS: t-lc2exp
PASS: t-mt
PASS: t-rand
PASS: t-urbui
PASS: t-urmui
PASS: t-urndmm
==================
All 7 tests passed
==================
make[4]:正在离开目录 `/home/zhu/armlinux/build-tools/gmp-4.2.1/tests/rand'
make[3]:正在离开目录 `/home/zhu/armlinux/build-tools/gmp-4.2.1/tests/rand'
Making check in misc
make[3]: 正在进入目录 `/home/zhu/armlinux/build-tools/gmp-4.2.1/tests/misc'
make t-printf t-scanf t-locale
make[4]: 正在进入目录 `/home/zhu/armlinux/build-tools/gmp-4.2.1/tests/misc'
make[4]: “t-printf”是最新的。
make[4]: “t-scanf”是最新的。
make[4]: “t-locale”是最新的。
make[4]:正在离开目录 `/home/zhu/armlinux/build-tools/gmp-4.2.1/tests/misc'
make check-TESTS
make[4]: 正在进入目录 `/home/zhu/armlinux/build-tools/gmp-4.2.1/tests/misc'
PASS: t-printf
PASS: t-scanf
PASS: t-locale
==================
All 3 tests passed
==================
make[4]:正在离开目录 `/home/zhu/armlinux/build-tools/gmp-4.2.1/tests/misc'
make[3]:正在离开目录 `/home/zhu/armlinux/build-tools/gmp-4.2.1/tests/misc'
Making check in cxx
make[3]: 正在进入目录 `/home/zhu/armlinux/build-tools/gmp-4.2.1/tests/cxx'
make
make[4]: 正在进入目录 `/home/zhu/armlinux/build-tools/gmp-4.2.1/tests/cxx'
make[4]: 没有什么可以做的为 `all'。
make[4]:正在离开目录 `/home/zhu/armlinux/build-tools/gmp-4.2.1/tests/cxx'
make check-TESTS
make[4]: 正在进入目录 `/home/zhu/armlinux/build-tools/gmp-4.2.1/tests/cxx'
make[4]:正在离开目录 `/home/zhu/armlinux/build-tools/gmp-4.2.1/tests/cxx'
make[3]:正在离开目录 `/home/zhu/armlinux/build-tools/gmp-4.2.1/tests/cxx'
Making check in mpbsd
make[3]: 正在进入目录 `/home/zhu/armlinux/build-tools/gmp-4.2.1/tests/mpbsd'
make
make[4]: 正在进入目录 `/home/zhu/armlinux/build-tools/gmp-4.2.1/tests/mpbsd'
make[4]: 没有什么可以做的为 `all'。
make[4]:正在离开目录 `/home/zhu/armlinux/build-tools/gmp-4.2.1/tests/mpbsd'
make check-TESTS
make[4]: 正在进入目录 `/home/zhu/armlinux/build-tools/gmp-4.2.1/tests/mpbsd'
make[4]:正在离开目录 `/home/zhu/armlinux/build-tools/gmp-4.2.1/tests/mpbsd'
make[3]:正在离开目录 `/home/zhu/armlinux/build-tools/gmp-4.2.1/tests/mpbsd'
make[2]:正在离开目录 `/home/zhu/armlinux/build-tools/gmp-4.2.1/tests'
Making check in mpn
make[2]: 正在进入目录 `/home/zhu/armlinux/build-tools/gmp-4.2.1/mpn'
make[2]: 没有什么可以做的为 `check'。
make[2]:正在离开目录 `/home/zhu/armlinux/build-tools/gmp-4.2.1/mpn'
Making check in mpz
make[2]: 正在进入目录 `/home/zhu/armlinux/build-tools/gmp-4.2.1/mpz'
make[2]: 没有什么可以做的为 `check'。
make[2]:正在离开目录 `/home/zhu/armlinux/build-tools/gmp-4.2.1/mpz'
Making check in mpq
make[2]: 正在进入目录 `/home/zhu/armlinux/build-tools/gmp-4.2.1/mpq'
make[2]: 没有什么可以做的为 `check'。
make[2]:正在离开目录 `/home/zhu/armlinux/build-tools/gmp-4.2.1/mpq'
Making check in mpf
make[2]: 正在进入目录 `/home/zhu/armlinux/build-tools/gmp-4.2.1/mpf'
make[2]: 没有什么可以做的为 `check'。
make[2]:正在离开目录 `/home/zhu/armlinux/build-tools/gmp-4.2.1/mpf'
Making check in printf
make[2]: 正在进入目录 `/home/zhu/armlinux/build-tools/gmp-4.2.1/printf'
make[2]: 没有什么可以做的为 `check'。
make[2]:正在离开目录 `/home/zhu/armlinux/build-tools/gmp-4.2.1/printf'
Making check in scanf
make[2]: 正在进入目录 `/home/zhu/armlinux/build-tools/gmp-4.2.1/scanf'
make[2]: 没有什么可以做的为 `check'。
make[2]:正在离开目录 `/home/zhu/armlinux/build-tools/gmp-4.2.1/scanf'
Making check in cxx
make[2]: 正在进入目录 `/home/zhu/armlinux/build-tools/gmp-4.2.1/cxx'
make[2]: 没有什么可以做的为 `check'。
make[2]:正在离开目录 `/home/zhu/armlinux/build-tools/gmp-4.2.1/cxx'
Making check in mpbsd
make[2]: 正在进入目录 `/home/zhu/armlinux/build-tools/gmp-4.2.1/mpbsd'
make[2]: 没有什么可以做的为 `check'。
make[2]:正在离开目录 `/home/zhu/armlinux/build-tools/gmp-4.2.1/mpbsd'
Making check in demos
make[2]: 正在进入目录 `/home/zhu/armlinux/build-tools/gmp-4.2.1/demos'
Making check in calc
make[3]: 正在进入目录 `/home/zhu/armlinux/build-tools/gmp-4.2.1/demos/calc'
make check-am
make[4]: 正在进入目录 `/home/zhu/armlinux/build-tools/gmp-4.2.1/demos/calc'
make[4]: 没有什么可以做的为 `check-am'。
make[4]:正在离开目录 `/home/zhu/armlinux/build-tools/gmp-4.2.1/demos/calc'
make[3]:正在离开目录 `/home/zhu/armlinux/build-tools/gmp-4.2.1/demos/calc'
Making check in expr
make[3]: 正在进入目录 `/home/zhu/armlinux/build-tools/gmp-4.2.1/demos/expr'
make[3]: 没有什么可以做的为 `check'。
make[3]:正在离开目录 `/home/zhu/armlinux/build-tools/gmp-4.2.1/demos/expr'
make[3]: 正在进入目录 `/home/zhu/armlinux/build-tools/gmp-4.2.1/demos'
make[3]: 没有什么可以做的为 `check-am'。
make[3]:正在离开目录 `/home/zhu/armlinux/build-tools/gmp-4.2.1/demos'
make[2]:正在离开目录 `/home/zhu/armlinux/build-tools/gmp-4.2.1/demos'
Making check in tune
make[2]: 正在进入目录 `/home/zhu/armlinux/build-tools/gmp-4.2.1/tune'
make[2]: 没有什么可以做的为 `check'。
make[2]:正在离开目录 `/home/zhu/armlinux/build-tools/gmp-4.2.1/tune'
Making check in doc
make[2]: 正在进入目录 `/home/zhu/armlinux/build-tools/gmp-4.2.1/doc'
make[2]: 没有什么可以做的为 `check'。
make[2]:正在离开目录 `/home/zhu/armlinux/build-tools/gmp-4.2.1/doc'
make[2]: 正在进入目录 `/home/zhu/armlinux/build-tools/gmp-4.2.1'
make[2]:正在离开目录 `/home/zhu/armlinux/build-tools/gmp-4.2.1'
make[1]:正在离开目录 `/home/zhu/armlinux/build-tools/gmp-4.2.1'


_________________
.......................I love google.....................


页首
 用户资料  
 
2 楼 
 文章标题 : Re: 安装gmp4.2.1中遇到如下问题,望大虾解决。
帖子发表于 : 2009-01-05 14:27 
头像

注册: 2008-12-22 12:24
帖子: 18
送出感谢: 0 次
接收感谢: 0 次
然后是make install 后的代码,感觉install后的显示让我觉得没有装的好(我是个新手哈,莫见怪)

u@ubuntu:~/armlinux/build-tools/gmp-4.2.1$ make install
make install-recursive
make[1]: 正在进入目录 `/home/zhu/armlinux/build-tools/gmp-4.2.1'
Making install in tests
make[2]: 正在进入目录 `/home/zhu/armlinux/build-tools/gmp-4.2.1/tests'
Making install in .
make[3]: 正在进入目录 `/home/zhu/armlinux/build-tools/gmp-4.2.1/tests'
make[4]: 正在进入目录 `/home/zhu/armlinux/build-tools/gmp-4.2.1/tests'
make[4]: 没有什么可以做的为 `install-exec-am'。
make[4]: 没有什么可以做的为 `install-data-am'。
make[4]:正在离开目录 `/home/zhu/armlinux/build-tools/gmp-4.2.1/tests'
make[3]:正在离开目录 `/home/zhu/armlinux/build-tools/gmp-4.2.1/tests'
Making install in devel
make[3]: 正在进入目录 `/home/zhu/armlinux/build-tools/gmp-4.2.1/tests/devel'
make[4]: 正在进入目录 `/home/zhu/armlinux/build-tools/gmp-4.2.1/tests/devel'
make[4]: 没有什么可以做的为 `install-exec-am'。
make[4]: 没有什么可以做的为 `install-data-am'。
make[4]:正在离开目录 `/home/zhu/armlinux/build-tools/gmp-4.2.1/tests/devel'
make[3]:正在离开目录 `/home/zhu/armlinux/build-tools/gmp-4.2.1/tests/devel'
Making install in mpn
make[3]: 正在进入目录 `/home/zhu/armlinux/build-tools/gmp-4.2.1/tests/mpn'
make[4]: 正在进入目录 `/home/zhu/armlinux/build-tools/gmp-4.2.1/tests/mpn'
make[4]: 没有什么可以做的为 `install-exec-am'。
make[4]: 没有什么可以做的为 `install-data-am'。
make[4]:正在离开目录 `/home/zhu/armlinux/build-tools/gmp-4.2.1/tests/mpn'
make[3]:正在离开目录 `/home/zhu/armlinux/build-tools/gmp-4.2.1/tests/mpn'
Making install in mpz
make[3]: 正在进入目录 `/home/zhu/armlinux/build-tools/gmp-4.2.1/tests/mpz'
make[4]: 正在进入目录 `/home/zhu/armlinux/build-tools/gmp-4.2.1/tests/mpz'
make[4]: 没有什么可以做的为 `install-exec-am'。
make[4]: 没有什么可以做的为 `install-data-am'。
make[4]:正在离开目录 `/home/zhu/armlinux/build-tools/gmp-4.2.1/tests/mpz'
make[3]:正在离开目录 `/home/zhu/armlinux/build-tools/gmp-4.2.1/tests/mpz'
Making install in mpq
make[3]: 正在进入目录 `/home/zhu/armlinux/build-tools/gmp-4.2.1/tests/mpq'
make[4]: 正在进入目录 `/home/zhu/armlinux/build-tools/gmp-4.2.1/tests/mpq'
make[4]: 没有什么可以做的为 `install-exec-am'。
make[4]: 没有什么可以做的为 `install-data-am'。
make[4]:正在离开目录 `/home/zhu/armlinux/build-tools/gmp-4.2.1/tests/mpq'
make[3]:正在离开目录 `/home/zhu/armlinux/build-tools/gmp-4.2.1/tests/mpq'
Making install in mpf
make[3]: 正在进入目录 `/home/zhu/armlinux/build-tools/gmp-4.2.1/tests/mpf'
make[4]: 正在进入目录 `/home/zhu/armlinux/build-tools/gmp-4.2.1/tests/mpf'
make[4]: 没有什么可以做的为 `install-exec-am'。
make[4]: 没有什么可以做的为 `install-data-am'。
make[4]:正在离开目录 `/home/zhu/armlinux/build-tools/gmp-4.2.1/tests/mpf'
make[3]:正在离开目录 `/home/zhu/armlinux/build-tools/gmp-4.2.1/tests/mpf'
Making install in rand
make[3]: 正在进入目录 `/home/zhu/armlinux/build-tools/gmp-4.2.1/tests/rand'
make[4]: 正在进入目录 `/home/zhu/armlinux/build-tools/gmp-4.2.1/tests/rand'
make[4]: 没有什么可以做的为 `install-exec-am'。
make[4]: 没有什么可以做的为 `install-data-am'。
make[4]:正在离开目录 `/home/zhu/armlinux/build-tools/gmp-4.2.1/tests/rand'
make[3]:正在离开目录 `/home/zhu/armlinux/build-tools/gmp-4.2.1/tests/rand'
Making install in misc
make[3]: 正在进入目录 `/home/zhu/armlinux/build-tools/gmp-4.2.1/tests/misc'
make[4]: 正在进入目录 `/home/zhu/armlinux/build-tools/gmp-4.2.1/tests/misc'
make[4]: 没有什么可以做的为 `install-exec-am'。
make[4]: 没有什么可以做的为 `install-data-am'。
make[4]:正在离开目录 `/home/zhu/armlinux/build-tools/gmp-4.2.1/tests/misc'
make[3]:正在离开目录 `/home/zhu/armlinux/build-tools/gmp-4.2.1/tests/misc'
Making install in cxx
make[3]: 正在进入目录 `/home/zhu/armlinux/build-tools/gmp-4.2.1/tests/cxx'
make[4]: 正在进入目录 `/home/zhu/armlinux/build-tools/gmp-4.2.1/tests/cxx'
make[4]: 没有什么可以做的为 `install-exec-am'。
make[4]: 没有什么可以做的为 `install-data-am'。
make[4]:正在离开目录 `/home/zhu/armlinux/build-tools/gmp-4.2.1/tests/cxx'
make[3]:正在离开目录 `/home/zhu/armlinux/build-tools/gmp-4.2.1/tests/cxx'
Making install in mpbsd
make[3]: 正在进入目录 `/home/zhu/armlinux/build-tools/gmp-4.2.1/tests/mpbsd'
make[4]: 正在进入目录 `/home/zhu/armlinux/build-tools/gmp-4.2.1/tests/mpbsd'
make[4]: 没有什么可以做的为 `install-exec-am'。
make[4]: 没有什么可以做的为 `install-data-am'。
make[4]:正在离开目录 `/home/zhu/armlinux/build-tools/gmp-4.2.1/tests/mpbsd'
make[3]:正在离开目录 `/home/zhu/armlinux/build-tools/gmp-4.2.1/tests/mpbsd'
make[2]:正在离开目录 `/home/zhu/armlinux/build-tools/gmp-4.2.1/tests'
Making install in mpn
make[2]: 正在进入目录 `/home/zhu/armlinux/build-tools/gmp-4.2.1/mpn'
make[3]: 正在进入目录 `/home/zhu/armlinux/build-tools/gmp-4.2.1/mpn'
make[3]: 没有什么可以做的为 `install-exec-am'。
make[3]: 没有什么可以做的为 `install-data-am'。
make[3]:正在离开目录 `/home/zhu/armlinux/build-tools/gmp-4.2.1/mpn'
make[2]:正在离开目录 `/home/zhu/armlinux/build-tools/gmp-4.2.1/mpn'
Making install in mpz
make[2]: 正在进入目录 `/home/zhu/armlinux/build-tools/gmp-4.2.1/mpz'
make[3]: 正在进入目录 `/home/zhu/armlinux/build-tools/gmp-4.2.1/mpz'
make[3]: 没有什么可以做的为 `install-exec-am'。
make[3]: 没有什么可以做的为 `install-data-am'。
make[3]:正在离开目录 `/home/zhu/armlinux/build-tools/gmp-4.2.1/mpz'
make[2]:正在离开目录 `/home/zhu/armlinux/build-tools/gmp-4.2.1/mpz'
Making install in mpq
make[2]: 正在进入目录 `/home/zhu/armlinux/build-tools/gmp-4.2.1/mpq'
make[3]: 正在进入目录 `/home/zhu/armlinux/build-tools/gmp-4.2.1/mpq'
make[3]: 没有什么可以做的为 `install-exec-am'。
make[3]: 没有什么可以做的为 `install-data-am'。
make[3]:正在离开目录 `/home/zhu/armlinux/build-tools/gmp-4.2.1/mpq'
make[2]:正在离开目录 `/home/zhu/armlinux/build-tools/gmp-4.2.1/mpq'
Making install in mpf
make[2]: 正在进入目录 `/home/zhu/armlinux/build-tools/gmp-4.2.1/mpf'
make[3]: 正在进入目录 `/home/zhu/armlinux/build-tools/gmp-4.2.1/mpf'
make[3]: 没有什么可以做的为 `install-exec-am'。
make[3]: 没有什么可以做的为 `install-data-am'。
make[3]:正在离开目录 `/home/zhu/armlinux/build-tools/gmp-4.2.1/mpf'
make[2]:正在离开目录 `/home/zhu/armlinux/build-tools/gmp-4.2.1/mpf'
Making install in printf
make[2]: 正在进入目录 `/home/zhu/armlinux/build-tools/gmp-4.2.1/printf'
make[3]: 正在进入目录 `/home/zhu/armlinux/build-tools/gmp-4.2.1/printf'
make[3]: 没有什么可以做的为 `install-exec-am'。
make[3]: 没有什么可以做的为 `install-data-am'。
make[3]:正在离开目录 `/home/zhu/armlinux/build-tools/gmp-4.2.1/printf'
make[2]:正在离开目录 `/home/zhu/armlinux/build-tools/gmp-4.2.1/printf'
Making install in scanf
make[2]: 正在进入目录 `/home/zhu/armlinux/build-tools/gmp-4.2.1/scanf'
make[3]: 正在进入目录 `/home/zhu/armlinux/build-tools/gmp-4.2.1/scanf'
make[3]: 没有什么可以做的为 `install-exec-am'。
make[3]: 没有什么可以做的为 `install-data-am'。
make[3]:正在离开目录 `/home/zhu/armlinux/build-tools/gmp-4.2.1/scanf'
make[2]:正在离开目录 `/home/zhu/armlinux/build-tools/gmp-4.2.1/scanf'
Making install in cxx
make[2]: 正在进入目录 `/home/zhu/armlinux/build-tools/gmp-4.2.1/cxx'
make[3]: 正在进入目录 `/home/zhu/armlinux/build-tools/gmp-4.2.1/cxx'
make[3]: 没有什么可以做的为 `install-exec-am'。
make[3]: 没有什么可以做的为 `install-data-am'。
make[3]:正在离开目录 `/home/zhu/armlinux/build-tools/gmp-4.2.1/cxx'
make[2]:正在离开目录 `/home/zhu/armlinux/build-tools/gmp-4.2.1/cxx'
Making install in mpbsd
make[2]: 正在进入目录 `/home/zhu/armlinux/build-tools/gmp-4.2.1/mpbsd'
make[3]: 正在进入目录 `/home/zhu/armlinux/build-tools/gmp-4.2.1/mpbsd'
make[3]: 没有什么可以做的为 `install-exec-am'。
make[3]: 没有什么可以做的为 `install-data-am'。
make[3]:正在离开目录 `/home/zhu/armlinux/build-tools/gmp-4.2.1/mpbsd'
make[2]:正在离开目录 `/home/zhu/armlinux/build-tools/gmp-4.2.1/mpbsd'
Making install in demos
make[2]: 正在进入目录 `/home/zhu/armlinux/build-tools/gmp-4.2.1/demos'
Making install in calc
make[3]: 正在进入目录 `/home/zhu/armlinux/build-tools/gmp-4.2.1/demos/calc'
make install-am
make[4]: 正在进入目录 `/home/zhu/armlinux/build-tools/gmp-4.2.1/demos/calc'
make[5]: 正在进入目录 `/home/zhu/armlinux/build-tools/gmp-4.2.1/demos/calc'
make[5]: 没有什么可以做的为 `install-exec-am'。
make[5]: 没有什么可以做的为 `install-data-am'。
make[5]:正在离开目录 `/home/zhu/armlinux/build-tools/gmp-4.2.1/demos/calc'
make[4]:正在离开目录 `/home/zhu/armlinux/build-tools/gmp-4.2.1/demos/calc'
make[3]:正在离开目录 `/home/zhu/armlinux/build-tools/gmp-4.2.1/demos/calc'
Making install in expr
make[3]: 正在进入目录 `/home/zhu/armlinux/build-tools/gmp-4.2.1/demos/expr'
make[4]: 正在进入目录 `/home/zhu/armlinux/build-tools/gmp-4.2.1/demos/expr'
make[4]: 没有什么可以做的为 `install-exec-am'。
make[4]: 没有什么可以做的为 `install-data-am'。
make[4]:正在离开目录 `/home/zhu/armlinux/build-tools/gmp-4.2.1/demos/expr'
make[3]:正在离开目录 `/home/zhu/armlinux/build-tools/gmp-4.2.1/demos/expr'
make[3]: 正在进入目录 `/home/zhu/armlinux/build-tools/gmp-4.2.1/demos'
make[4]: 正在进入目录 `/home/zhu/armlinux/build-tools/gmp-4.2.1/demos'
make[4]: 没有什么可以做的为 `install-exec-am'。
make[4]: 没有什么可以做的为 `install-data-am'。
make[4]:正在离开目录 `/home/zhu/armlinux/build-tools/gmp-4.2.1/demos'
make[3]:正在离开目录 `/home/zhu/armlinux/build-tools/gmp-4.2.1/demos'
make[2]:正在离开目录 `/home/zhu/armlinux/build-tools/gmp-4.2.1/demos'
Making install in tune
make[2]: 正在进入目录 `/home/zhu/armlinux/build-tools/gmp-4.2.1/tune'
make[3]: 正在进入目录 `/home/zhu/armlinux/build-tools/gmp-4.2.1/tune'
make[3]: 没有什么可以做的为 `install-exec-am'。
make[3]: 没有什么可以做的为 `install-data-am'。
make[3]:正在离开目录 `/home/zhu/armlinux/build-tools/gmp-4.2.1/tune'
make[2]:正在离开目录 `/home/zhu/armlinux/build-tools/gmp-4.2.1/tune'
Making install in doc
make[2]: 正在进入目录 `/home/zhu/armlinux/build-tools/gmp-4.2.1/doc'
make[3]: 正在进入目录 `/home/zhu/armlinux/build-tools/gmp-4.2.1/doc'
make[3]: 没有什么可以做的为 `install-exec-am'。
test -z "/usr/local/info" || mkdir -p -- . "/usr/local/info"
mkdir: 无法创建目录 “/usr/local/info”: Permission denied
make[3]: *** [install-info-am] 错误 1
make[3]:正在离开目录 `/home/zhu/armlinux/build-tools/gmp-4.2.1/doc'
make[2]: *** [install-am] 错误 2
make[2]:正在离开目录 `/home/zhu/armlinux/build-tools/gmp-4.2.1/doc'
make[1]: *** [install-recursive] 错误 1
make[1]:正在离开目录 `/home/zhu/armlinux/build-tools/gmp-4.2.1'
make: *** [install] 错误 2


_________________
.......................I love google.....................


页首
 用户资料  
 
3 楼 
 文章标题 : Re: 安装gmp4.2.1中遇到如下问题,望大虾解决。
帖子发表于 : 2009-01-05 14:28 
头像

注册: 2008-12-22 12:24
帖子: 18
送出感谢: 0 次
接收感谢: 0 次
我是看了INSTALL后照着它上面写的来装的:

./configure
make
make check
make install



_________________
.......................I love google.....................


页首
 用户资料  
 
4 楼 
 文章标题 : Re: 安装gmp4.2.1中遇到如下问题,望大虾解决。
帖子发表于 : 2009-01-05 17:35 
头像

注册: 2008-12-22 12:24
帖子: 18
送出感谢: 0 次
接收感谢: 0 次
问题已初步解决,所以自己贴出方法:关键还是INSTALL的英文文档的阅读要仔细:

Optionally, you can install the library with the following command. This will
be to /usr/local by default, and you'll probably need to be "root" to be able
to write there.

make install

之前的指令如:./configure make make check 基本都不会出现问题的,那么这个make install出现的问题的原因就是因为需要权限,都知道root的意思撒,所以这里指令可以写成
sudo make install 我就是这么搞的


_________________
.......................I love google.....................


页首
 用户资料  
 
5 楼 
 文章标题 : Re: 安装gmp4.2.1中遇到如下问题,望大虾解决。
帖子发表于 : 2009-01-05 17:54 
头像

注册: 2007-09-29 3:09
帖子: 5773
送出感谢: 0 次
接收感谢: 3
编译这个做什么?折腾?还是哪个软件疯到要求最新的gcc才能编译?


_________________
HUNT Unfortunately No Talent...


页首
 用户资料  
 
显示帖子 :  排序  
发表新帖 回复这个主题  [ 5 篇帖子 ] 

当前时区为 UTC + 8 小时


在线用户

正在浏览此版面的用户:没有注册用户 和 1 位游客


不能 在这个版面发表主题
不能 在这个版面回复主题
不能 在这个版面编辑帖子
不能 在这个版面删除帖子
不能 在这个版面提交附件

前往 :  
本站点为公益性站点,用于推广开源自由软件,由 DiaHosting VPSBudgetVM VPS 提供服务。
我们认为:软件应可免费取得,软件工具在各种语言环境下皆可使用,且不会有任何功能上的差异;
人们应有定制和修改软件的自由,且方式不受限制,只要他们自认为合适。

Powered by phpBB © 2000, 2002, 2005, 2007 phpBB Group
简体中文语系由 王笑宇 翻译