当前时区为 UTC + 8 小时



发表新帖 回复这个主题  [ 6 篇帖子 ] 
作者 内容
1 楼 
 文章标题 : 编译fcitx-3.6.2帮忙看看哪里出错??
帖子发表于 : 2009-10-30 21:53 

注册: 2008-08-30 14:51
帖子: 95
送出感谢: 0 次
接收感谢: 0 次
yunfei@yunfei-pc:~$ cd fcitx-3.6.2/
yunfei@yunfei-pc:~/fcitx-3.6.2$ sudo ./configure
[sudo] password for yunfei:
checking for a BSD-compatible install... /usr/bin/install -c
checking whether build environment is sane... yes
checking for a thread-safe mkdir -p... /bin/mkdir -p
checking for gawk... no
checking for mawk... mawk
checking whether make sets $(MAKE)... yes
checking build system type... i686-pc-linux-gnu
checking host system type... i686-pc-linux-gnu
checking for gcc... gcc
checking for C compiler default output file name... a.out
checking whether the C compiler works... yes
checking whether we are cross compiling... no
checking for suffix of executables...
checking for suffix of object files... o
checking whether we are using the GNU C compiler... yes
checking whether gcc accepts -g... yes
checking for gcc option to accept ISO C89... none needed
checking for style of include used by make... GNU
checking dependency style of gcc... gcc3
checking for a BSD-compatible install... /usr/bin/install -c
checking whether make sets $(MAKE)... (cached) yes
checking for ranlib... ranlib
checking for ld used by GCC... /usr/bin/ld
checking if the linker (/usr/bin/ld) is GNU ld... yes
checking for shared library run path origin... done
checking for iconv... yes
checking for working iconv... yes
checking for iconv declaration...
extern size_t iconv (iconv_t cd, char * *inbuf, size_t *inbytesleft, char * *outbuf, size_t *outbytesleft);
checking how to run the C preprocessor... gcc -E
checking for grep that handles long lines and -e... /bin/grep
checking for egrep... /bin/grep -E
checking for ANSI C header files... yes
checking for sys/wait.h that is POSIX.1 compatible... yes
checking for sys/types.h... yes
checking for sys/stat.h... yes
checking for stdlib.h... yes
checking for string.h... yes
checking for memory.h... yes
checking for strings.h... yes
checking for inttypes.h... yes
checking for stdint.h... yes
checking for unistd.h... yes
checking limits.h usability... yes
checking limits.h presence... yes
checking for limits.h... yes
checking malloc.h usability... yes
checking malloc.h presence... yes
checking for malloc.h... yes
checking malloc/malloc.h usability... no
checking malloc/malloc.h presence... no
checking for malloc/malloc.h... no
checking for stdlib.h... (cached) yes
checking for string.h... (cached) yes
checking sys/param.h usability... yes
checking sys/param.h presence... yes
checking for sys/param.h... yes
checking for unistd.h... (cached) yes
checking wait.h usability... yes
checking wait.h presence... yes
checking for wait.h... yes
checking for sys/wait.h... (cached) yes
checking machine/endian.h usability... no
checking machine/endian.h presence... no
checking for machine/endian.h... no
checking for X... no
checking for pkg-config... /usr/bin/pkg-config
checking pkg-config is at least version 0.9.0... yes
checking for XFT... no
configure: WARNING: No xft found, skipping configure for FreeType and Xft
checking for pid_t... yes
checking for size_t... yes
checking vfork.h usability... no
checking vfork.h presence... no
checking for vfork.h... no
checking for fork... no
checking for vfork... no
checking for stdlib.h... (cached) yes
checking for GNU libc compatible malloc... no
checking return type of signal handlers... void
checking for memmove... no
checking for memset... no
checking for mkdir... no
checking for setlocale... no
checking for strcasecmp... no
checking for strstr... no
checking for strtol... no
configure: creating ./config.status
config.status: creating Makefile
config.status: creating fcitx.spec
config.status: creating doc/Makefile
config.status: creating data/Makefile
config.status: creating xpm/Makefile
config.status: creating lib/Makefile
config.status: creating src/version.h
config.status: creating src/Makefile
config.status: creating tools/Makefile
config.status: creating config.h
config.status: executing depfiles commands
yunfei@yunfei-pc:~/fcitx-3.6.2$ sudo make
make all-recursive
make[1]: 正在进入目录 `/home/yunfei/fcitx-3.6.2'
Making all in doc
make[2]: 正在进入目录 `/home/yunfei/fcitx-3.6.2/doc'
make[2]: 没有什么可以做的为 `all'。
make[2]:正在离开目录 `/home/yunfei/fcitx-3.6.2/doc'
Making all in xpm
make[2]: 正在进入目录 `/home/yunfei/fcitx-3.6.2/xpm'
make[2]: 没有什么可以做的为 `all'。
make[2]:正在离开目录 `/home/yunfei/fcitx-3.6.2/xpm'
Making all in lib
make[2]: 正在进入目录 `/home/yunfei/fcitx-3.6.2/lib'
gcc -DHAVE_CONFIG_H -I. -I.. -c -O2 -fno-strength-reduce -fno-strict-aliasing -g -O2 -INONE -INONE -D_ENABLE_TRAY -INONE -D_ENABLE_LOG -INONE -Wall -MT FrameMgr.o -MD -MP -MF .deps/FrameMgr.Tpo -c -o FrameMgr.o FrameMgr.c
FrameMgr.c:29:25: error: X11/Xlibint.h: 没有该文件或目录
In file included from FrameMgr.c:31:
FrameMgr.h:32:21: error: X11/Xmd.h: 没有该文件或目录
FrameMgr.h:33:22: error: X11/Xlib.h: 没有该文件或目录
In file included from FrameMgr.c:31:
FrameMgr.h:112: error: expected declaration specifiers or ‘...’ before ‘Bool’
FrameMgr.h:114: error: expected declaration specifiers or ‘...’ before ‘Bool’
FrameMgr.h:126: error: expected ‘=’, ‘,’, ‘;’, ‘asm’ or ‘__attribute__’ before ‘FrameMgrIsIterLoopEnd’
FrameMgr.c:95: error: expected specifier-qualifier-list before ‘Bool’
FrameMgr.c:114: error: expected specifier-qualifier-list before ‘Bool’
FrameMgr.c:128: error: expected specifier-qualifier-list before ‘Bool’
FrameMgr.c:139: error: expected specifier-qualifier-list before ‘Bool’
FrameMgr.c:166: error: expected ‘=’, ‘,’, ‘;’, ‘asm’ or ‘__attribute__’ before ‘IterIsLoopEnd’
FrameMgr.c:173: error: expected ‘=’, ‘,’, ‘;’, ‘asm’ or ‘__attribute__’ before ‘ChainIterGetNext’
FrameMgr.c:177: error: expected ‘=’, ‘,’, ‘;’, ‘asm’ or ‘__attribute__’ before ‘FrameInstIsIterLoopEnd’
FrameMgr.c:182: error: expected ‘=’, ‘,’, ‘;’, ‘asm’ or ‘__attribute__’ before ‘_FrameMgrIsIterLoopEnd’
FrameMgr.c:183: error: expected ‘=’, ‘,’, ‘;’, ‘asm’ or ‘__attribute__’ before ‘_FrameMgrProcessPadding’
FrameMgr.c:216: error: expected declaration specifiers or ‘...’ before ‘Bool’
FrameMgr.c: In function ‘FrameMgrInit’:
FrameMgr.c:220: warning: implicit declaration of function ‘Xmalloc’
FrameMgr.c:226: error: ‘struct _FrameMgr’ has no member named ‘byte_swap’
FrameMgr.c:226: error: ‘byte_swap’ undeclared (first use in this function)
FrameMgr.c:226: error: (Each undeclared identifier is reported only once
FrameMgr.c:226: error: for each function it appears in.)
FrameMgr.c:227: error: ‘struct _FrameMgr’ has no member named ‘total_size’
FrameMgr.c:228: error: ‘struct _FrameMgr’ has no member named ‘iters’
FrameMgr.c: At top level:
FrameMgr.c:236: error: expected declaration specifiers or ‘...’ before ‘Bool’
FrameMgr.c: In function ‘FrameMgrInitWithData’:
FrameMgr.c:242: error: ‘struct _FrameMgr’ has no member named ‘byte_swap’
FrameMgr.c:242: error: ‘byte_swap’ undeclared (first use in this function)
FrameMgr.c:243: error: ‘struct _FrameMgr’ has no member named ‘total_size’
FrameMgr.c: In function ‘FrameMgrFree’:
FrameMgr.c:249: warning: implicit declaration of function ‘Xfree’
FrameMgr.c: In function ‘_FrameMgrPutToken’:
FrameMgr.c:265: error: ‘struct _FrameMgr’ has no member named ‘total_size’
FrameMgr.c:265: error: ‘struct _FrameMgr’ has no member named ‘total_size’
FrameMgr.c:275: error: ‘struct <anonymous>’ has no member named ‘is_byte_len’
FrameMgr.c:286: error: ‘struct _Iter’ has no member named ‘allow_expansion’
FrameMgr.c:297: error: ‘CARD8’ undeclared (first use in this function)
FrameMgr.c:297: error: expected expression before ‘)’ token
FrameMgr.c:302: error: ‘CARD16’ undeclared (first use in this function)
FrameMgr.c:302: error: expected expression before ‘)’ token
FrameMgr.c:302: error: ‘struct _FrameMgr’ has no member named ‘byte_swap’
FrameMgr.c:307: error: ‘CARD32’ undeclared (first use in this function)
FrameMgr.c:307: error: expected expression before ‘)’ token
FrameMgr.c:307: error: ‘struct _FrameMgr’ has no member named ‘byte_swap’
FrameMgr.c:332: error: expected expression before ‘)’ token
FrameMgr.c:337: error: expected expression before ‘)’ token
FrameMgr.c:342: error: expected expression before ‘)’ token
FrameMgr.c:347: error: expected expression before ‘)’ token
FrameMgr.c:361: error: expected expression before ‘)’ token
FrameMgr.c:361: error: ‘struct _FrameMgr’ has no member named ‘byte_swap’
FrameMgr.c:366: error: expected expression before ‘)’ token
FrameMgr.c:366: error: ‘struct _FrameMgr’ has no member named ‘byte_swap’
FrameMgr.c:371: error: expected expression before ‘)’ token
FrameMgr.c:371: error: ‘struct _FrameMgr’ has no member named ‘byte_swap’
FrameMgr.c:376: error: expected expression before ‘)’ token
FrameMgr.c:376: error: ‘struct _FrameMgr’ has no member named ‘byte_swap’
FrameMgr.c:390: error: expected expression before ‘)’ token
FrameMgr.c:390: error: ‘struct _FrameMgr’ has no member named ‘byte_swap’
FrameMgr.c:395: error: expected expression before ‘)’ token
FrameMgr.c:395: error: ‘struct _FrameMgr’ has no member named ‘byte_swap’
FrameMgr.c:400: error: expected expression before ‘)’ token
FrameMgr.c:400: error: ‘struct _FrameMgr’ has no member named ‘byte_swap’
FrameMgr.c:405: error: expected expression before ‘)’ token
FrameMgr.c:405: error: ‘struct _FrameMgr’ has no member named ‘byte_swap’
FrameMgr.c:452: warning: implicit declaration of function ‘bcopy’
FrameMgr.c:452: warning: incompatible implicit declaration of built-in function ‘bcopy’
FrameMgr.c: In function ‘_FrameMgrGetToken’:
FrameMgr.c:483: error: ‘struct _FrameMgr’ has no member named ‘total_size’
FrameMgr.c:483: error: ‘struct _FrameMgr’ has no member named ‘total_size’
FrameMgr.c:498: error: ‘CARD8’ undeclared (first use in this function)
FrameMgr.c:498: error: expected expression before ‘)’ token
FrameMgr.c:502: error: ‘struct _FrameMgr’ has no member named ‘byte_swap’
FrameMgr.c:502: error: ‘CARD16’ undeclared (first use in this function)
FrameMgr.c:502: error: expected expression before ‘)’ token
FrameMgr.c:502: error: expected expression before ‘)’ token
FrameMgr.c:502: error: expected expression before ‘)’ token
FrameMgr.c:506: error: ‘struct _FrameMgr’ has no member named ‘byte_swap’
FrameMgr.c:506: error: ‘CARD32’ undeclared (first use in this function)
FrameMgr.c:506: error: expected expression before ‘)’ token
FrameMgr.c:506: error: expected expression before ‘)’ token
FrameMgr.c:506: error: expected expression before ‘)’ token
FrameMgr.c:506: error: expected expression before ‘)’ token
FrameMgr.c:506: error: expected expression before ‘)’ token
FrameMgr.c:521: error: ‘struct _Iter’ has no member named ‘start_counter’
FrameMgr.c:521: error: ‘True’ undeclared (first use in this function)
FrameMgr.c:536: error: expected expression before ‘)’ token
FrameMgr.c:540: error: expected expression before ‘)’ token
FrameMgr.c:544: error: expected expression before ‘)’ token
FrameMgr.c:548: error: expected expression before ‘)’ token
FrameMgr.c:556: error: ‘struct _FrameMgr’ has no member named ‘iters’
FrameMgr.c:565: error: ‘struct _FrameMgr’ has no member named ‘byte_swap’
FrameMgr.c:565: error: expected expression before ‘)’ token
FrameMgr.c:565: error: expected expression before ‘)’ token
FrameMgr.c:565: error: expected expression before ‘)’ token
FrameMgr.c:570: error: ‘struct _FrameMgr’ has no member named ‘byte_swap’
FrameMgr.c:570: error: expected expression before ‘)’ token
FrameMgr.c:570: error: expected expression before ‘)’ token
FrameMgr.c:570: error: expected expression before ‘)’ token
FrameMgr.c:575: error: ‘struct _FrameMgr’ has no member named ‘byte_swap’
FrameMgr.c:575: error: expected expression before ‘)’ token
FrameMgr.c:575: error: expected expression before ‘)’ token
FrameMgr.c:575: error: expected expression before ‘)’ token
FrameMgr.c:580: error: ‘struct _FrameMgr’ has no member named ‘byte_swap’
FrameMgr.c:580: error: expected expression before ‘)’ token
FrameMgr.c:580: error: expected expression before ‘)’ token
FrameMgr.c:580: error: expected expression before ‘)’ token
FrameMgr.c:588: error: ‘struct _FrameMgr’ has no member named ‘iters’
FrameMgr.c:597: error: ‘struct _FrameMgr’ has no member named ‘byte_swap’
FrameMgr.c:597: error: expected expression before ‘)’ token
FrameMgr.c:597: error: expected expression before ‘)’ token
FrameMgr.c:597: error: expected expression before ‘)’ token
FrameMgr.c:597: error: expected expression before ‘)’ token
FrameMgr.c:597: error: expected expression before ‘)’ token
FrameMgr.c:602: error: ‘struct _FrameMgr’ has no member named ‘byte_swap’
FrameMgr.c:602: error: expected expression before ‘)’ token
FrameMgr.c:602: error: expected expression before ‘)’ token
FrameMgr.c:602: error: expected expression before ‘)’ token
FrameMgr.c:602: error: expected expression before ‘)’ token
FrameMgr.c:602: error: expected expression before ‘)’ token
FrameMgr.c:607: error: ‘struct _FrameMgr’ has no member named ‘byte_swap’
FrameMgr.c:607: error: expected expression before ‘)’ token
FrameMgr.c:607: error: expected expression before ‘)’ token
FrameMgr.c:607: error: expected expression before ‘)’ token
FrameMgr.c:607: error: expected expression before ‘)’ token
FrameMgr.c:607: error: expected expression before ‘)’ token
FrameMgr.c:612: error: ‘struct _FrameMgr’ has no member named ‘byte_swap’
FrameMgr.c:612: error: expected expression before ‘)’ token
FrameMgr.c:612: error: expected expression before ‘)’ token
FrameMgr.c:612: error: expected expression before ‘)’ token
FrameMgr.c:612: error: expected expression before ‘)’ token
FrameMgr.c:612: error: expected expression before ‘)’ token
FrameMgr.c:620: error: ‘struct _FrameMgr’ has no member named ‘iters’
FrameMgr.c:668: error: ‘struct _FrameMgr’ has no member named ‘iters’
FrameMgr.c:684: error: ‘struct _FrameMgr’ has no member named ‘iters’
FrameMgr.c: In function ‘FrameMgrSetTotalSize’:
FrameMgr.c:719: error: ‘struct _FrameMgr’ has no member named ‘total_size’
FrameMgr.c: In function ‘FrameMgrSkipToken’:
FrameMgr.c:745: error: ‘struct _FrameMgr’ has no member named ‘total_size’
FrameMgr.c:745: error: ‘struct _FrameMgr’ has no member named ‘total_size’
FrameMgr.c: At top level:
FrameMgr.c:805: error: expected ‘=’, ‘,’, ‘;’, ‘asm’ or ‘__attribute__’ before ‘FrameMgrIsIterLoopEnd’
FrameMgr.c:821: error: expected ‘=’, ‘,’, ‘;’, ‘asm’ or ‘__attribute__’ before ‘_FrameMgrIsIterLoopEnd’
FrameMgr.c:826: error: expected ‘=’, ‘,’, ‘;’, ‘asm’ or ‘__attribute__’ before ‘_FrameMgrProcessPadding’
FrameMgr.c: In function ‘FrameInstFree’:
FrameMgr.c:873: warning: implicit declaration of function ‘ChainIterGetNext’
FrameMgr.c: In function ‘FrameInstGetNextType’:
FrameMgr.c:921: error: ‘struct <anonymous>’ has no member named ‘is_byte_len’
FrameMgr.c: In function ‘FrameInstPeekNextType’:
FrameMgr.c:1072: error: ‘struct <anonymous>’ has no member named ‘is_byte_len’
FrameMgr.c: At top level:
FrameMgr.c:1185: error: expected ‘=’, ‘,’, ‘;’, ‘asm’ or ‘__attribute__’ before ‘FrameInstIsIterLoopEnd’
FrameMgr.c: In function ‘_FrameMgrAppendIter’:
FrameMgr.c:1209: error: ‘struct _FrameMgr’ has no member named ‘iters’
FrameMgr.c:1211: error: ‘struct _FrameIter’ has no member named ‘next’
FrameMgr.c:1212: error: ‘struct _FrameIter’ has no member named ‘next’
FrameMgr.c:1217: error: ‘struct _FrameMgr’ has no member named ‘iters’
FrameMgr.c:1222: error: ‘struct _FrameIter’ has no member named ‘next’
FrameMgr.c:1223: error: ‘struct _FrameIter’ has no member named ‘next’
FrameMgr.c:1229: error: ‘struct _FrameIter’ has no member named ‘counting’
FrameMgr.c:1229: error: ‘False’ undeclared (first use in this function)
FrameMgr.c:1230: error: ‘struct _FrameIter’ has no member named ‘counter’
FrameMgr.c:1231: error: ‘struct _FrameIter’ has no member named ‘end’
FrameMgr.c:1232: error: ‘struct _FrameIter’ has no member named ‘next’
FrameMgr.c: In function ‘_FrameMgrRemoveIter’:
FrameMgr.c:1244: error: ‘struct _FrameMgr’ has no member named ‘iters’
FrameMgr.c:1250: error: ‘struct _FrameIter’ has no member named ‘next’
FrameMgr.c:1250: error: ‘struct _FrameIter’ has no member named ‘next’
FrameMgr.c:1252: error: ‘struct _FrameMgr’ has no member named ‘iters’
FrameMgr.c:1252: error: ‘struct _FrameIter’ has no member named ‘next’
FrameMgr.c:1259: error: ‘struct _FrameIter’ has no member named ‘next’
FrameMgr.c: In function ‘_FrameIterCounterIncr’:
FrameMgr.c:1270: error: ‘struct _FrameIter’ has no member named ‘counting’
FrameMgr.c:1272: error: ‘struct _FrameIter’ has no member named ‘counter’
FrameMgr.c:1273: error: ‘struct _FrameIter’ has no member named ‘counter’
FrameMgr.c:1273: error: ‘struct _FrameIter’ has no member named ‘end’
FrameMgr.c:1275: error: ‘struct _Iter’ has no member named ‘allow_expansion’
FrameMgr.c:1275: error: ‘False’ undeclared (first use in this function)
FrameMgr.c:1281: error: ‘struct _FrameIter’ has no member named ‘next’
FrameMgr.c: In function ‘_IterStartWatch’:
FrameMgr.c:1290: error: ‘struct _FrameIter’ has no member named ‘counting’
FrameMgr.c:1290: error: ‘True’ undeclared (first use in this function)
FrameMgr.c: In function ‘IterInit’:
FrameMgr.c:1510: error: ‘struct _Iter’ has no member named ‘allow_expansion’
FrameMgr.c:1511: error: ‘struct _Iter’ has no member named ‘cur_no’
FrameMgr.c:1512: error: ‘struct _Iter’ has no member named ‘start_watch_proc’
FrameMgr.c:1513: error: ‘struct _Iter’ has no member named ‘client_data’
FrameMgr.c:1514: error: ‘struct _Iter’ has no member named ‘start_counter’
FrameMgr.c:1514: error: ‘False’ undeclared (first use in this function)
FrameMgr.c:1537: error: ‘struct _Iter’ has no member named ‘cm’
FrameMgr.c:1537: error: ‘struct _Iter’ has no member named ‘cm’
FrameMgr.c: In function ‘IterFree’:
FrameMgr.c:1553: error: ‘struct _Iter’ has no member named ‘cm’
FrameMgr.c:1562: error: ‘struct _Iter’ has no member named ‘cm’
FrameMgr.c:1567: error: ‘struct _Iter’ has no member named ‘cm’
FrameMgr.c:1577: error: ‘struct _Iter’ has no member named ‘cm’
FrameMgr.c:1582: error: ‘struct _Iter’ has no member named ‘cm’
FrameMgr.c: At top level:
FrameMgr.c:1593: error: expected ‘=’, ‘,’, ‘;’, ‘asm’ or ‘__attribute__’ before ‘IterIsLoopEnd’
FrameMgr.c: In function ‘IterGetNextType’:
FrameMgr.c:1654: error: ‘struct _Iter’ has no member named ‘start_counter’
FrameMgr.c:1656: error: ‘struct _Iter’ has no member named ‘start_watch_proc’
FrameMgr.c:1656: error: ‘struct _Iter’ has no member named ‘client_data’
FrameMgr.c:1657: error: ‘struct _Iter’ has no member named ‘start_counter’
FrameMgr.c:1657: error: ‘False’ undeclared (first use in this function)
FrameMgr.c:1660: error: ‘struct _Iter’ has no member named ‘cur_no’
FrameMgr.c:1662: error: ‘struct _Iter’ has no member named ‘allow_expansion’
FrameMgr.c:1663: error: ‘struct _Iter’ has no member named ‘cur_no’
FrameMgr.c:1676: error: ‘struct _Iter’ has no member named ‘cur_no’
FrameMgr.c:1684: error: ‘struct _Iter’ has no member named ‘cm’
FrameMgr.c:1684: error: ‘struct _Iter’ has no member named ‘cur_no’
FrameMgr.c:1691: error: ‘struct _Iter’ has no member named ‘cur_no’
FrameMgr.c:1700: error: ‘struct _Iter’ has no member named ‘cm’
FrameMgr.c:1700: error: ‘struct _Iter’ has no member named ‘cur_no’
FrameMgr.c:1703: error: ‘struct _Iter’ has no member named ‘cm’
FrameMgr.c:1703: error: ‘struct _Iter’ has no member named ‘cur_no’
FrameMgr.c:1710: error: ‘struct _Iter’ has no member named ‘cur_no’
FrameMgr.c:1723: error: ‘struct _Iter’ has no member named ‘cm’
FrameMgr.c:1723: error: ‘struct _Iter’ has no member named ‘cur_no’
FrameMgr.c:1726: error: ‘struct _Iter’ has no member named ‘cm’
FrameMgr.c:1726: error: ‘struct _Iter’ has no member named ‘cur_no’
FrameMgr.c:1733: error: ‘struct _Iter’ has no member named ‘cur_no’
FrameMgr.c: In function ‘IterPeekNextType’:
FrameMgr.c:1751: error: ‘struct _Iter’ has no member named ‘allow_expansion’
FrameMgr.c:1751: error: ‘struct _Iter’ has no member named ‘cur_no’
FrameMgr.c:1768: error: ‘struct _Iter’ has no member named ‘cm’
FrameMgr.c:1768: error: ‘struct _Iter’ has no member named ‘cur_no’
FrameMgr.c:1783: error: ‘struct _Iter’ has no member named ‘cm’
FrameMgr.c:1783: error: ‘struct _Iter’ has no member named ‘cur_no’
FrameMgr.c:1786: error: ‘struct _Iter’ has no member named ‘cm’
FrameMgr.c:1786: error: ‘struct _Iter’ has no member named ‘cur_no’
FrameMgr.c:1803: error: ‘struct _Iter’ has no member named ‘cm’
FrameMgr.c:1803: error: ‘struct _Iter’ has no member named ‘cur_no’
FrameMgr.c:1806: error: ‘struct _Iter’ has no member named ‘cm’
FrameMgr.c:1806: error: ‘struct _Iter’ has no member named ‘cur_no’
FrameMgr.c: In function ‘IterSetSize’:
FrameMgr.c:1830: error: ‘struct _Iter’ has no member named ‘allow_expansion’
FrameMgr.c:1844: error: ‘struct _Iter’ has no member named ‘cm’
FrameMgr.c:1847: error: ‘struct _Iter’ has no member named ‘cm’
FrameMgr.c:1858: error: ‘struct _Iter’ has no member named ‘allow_expansion’
FrameMgr.c:1863: error: ‘struct _Iter’ has no member named ‘cm’
FrameMgr.c:1879: error: ‘struct _Iter’ has no member named ‘cm’
FrameMgr.c:1882: error: ‘struct _Iter’ has no member named ‘cm’
FrameMgr.c:1890: error: ‘struct _Iter’ has no member named ‘allow_expansion’
FrameMgr.c:1895: error: ‘struct _Iter’ has no member named ‘cm’
FrameMgr.c:1913: error: ‘struct _Iter’ has no member named ‘cm’
FrameMgr.c:1916: error: ‘struct _Iter’ has no member named ‘cm’
FrameMgr.c:1924: error: ‘struct _Iter’ has no member named ‘allow_expansion’
FrameMgr.c:1929: error: ‘struct _Iter’ has no member named ‘cm’
FrameMgr.c: In function ‘IterGetSize’:
FrameMgr.c:1953: error: ‘struct _Iter’ has no member named ‘cur_no’
FrameMgr.c:1960: error: ‘struct _Iter’ has no member named ‘cm’
FrameMgr.c:1960: error: ‘struct _Iter’ has no member named ‘cur_no’
FrameMgr.c:1966: error: ‘struct _Iter’ has no member named ‘cur_no’
FrameMgr.c:1970: error: ‘struct _Iter’ has no member named ‘cm’
FrameMgr.c:1973: error: ‘struct _Iter’ has no member named ‘cm’
FrameMgr.c:1985: error: ‘struct _Iter’ has no member named ‘cur_no’
FrameMgr.c:1989: error: ‘struct _Iter’ has no member named ‘cm’
FrameMgr.c:1992: error: ‘struct _Iter’ has no member named ‘cm’
FrameMgr.c: In function ‘IterSetIterCount’:
FrameMgr.c:2014: error: ‘struct _Iter’ has no member named ‘allow_expansion’
FrameMgr.c:2017: error: ‘struct _Iter’ has no member named ‘allow_expansion’
FrameMgr.c:2017: error: ‘False’ undeclared (first use in this function)
FrameMgr.c:2034: error: ‘struct _Iter’ has no member named ‘cm’
FrameMgr.c:2037: error: ‘struct _Iter’ has no member named ‘cm’
FrameMgr.c:2046: error: ‘struct _Iter’ has no member named ‘allow_expansion’
FrameMgr.c:2051: error: ‘struct _Iter’ has no member named ‘cm’
FrameMgr.c:2065: error: ‘struct _Iter’ has no member named ‘cm’
FrameMgr.c:2068: error: ‘struct _Iter’ has no member named ‘cm’
FrameMgr.c:2076: error: ‘struct _Iter’ has no member named ‘allow_expansion’
FrameMgr.c:2081: error: ‘struct _Iter’ has no member named ‘cm’
FrameMgr.c: In function ‘IterGetTotalSize’:
FrameMgr.c:2103: error: ‘struct _Iter’ has no member named ‘allow_expansion’
FrameMgr.c:2137: error: ‘struct _Iter’ has no member named ‘cm’
FrameMgr.c:2154: error: ‘struct _Iter’ has no member named ‘cm’
FrameMgr.c:2172: error: ‘struct _Iter’ has no member named ‘cm’
FrameMgr.c:2175: error: ‘struct _Iter’ has no member named ‘cm’
FrameMgr.c: In function ‘IterReset’:
FrameMgr.c:2202: error: ‘struct _Iter’ has no member named ‘cm’
FrameMgr.c:2210: error: ‘struct _Iter’ has no member named ‘cm’
FrameMgr.c:2221: error: ‘struct _Iter’ has no member named ‘cur_no’
FrameMgr.c: In function ‘IterSetStartWatch’:
FrameMgr.c:2228: error: ‘struct _Iter’ has no member named ‘start_watch_proc’
FrameMgr.c:2229: error: ‘struct _Iter’ has no member named ‘client_data’
FrameMgr.c: At top level:
FrameMgr.c:2272: error: expected ‘=’, ‘,’, ‘;’, ‘asm’ or ‘__attribute__’ before ‘ChainIterGetNext’
make[2]: *** [FrameMgr.o] 错误 1
make[2]:正在离开目录 `/home/yunfei/fcitx-3.6.2/lib'
make[1]: *** [all-recursive] 错误 1
make[1]:正在离开目录 `/home/yunfei/fcitx-3.6.2'
make: *** [all] 错误 2


页首
 用户资料  
 
2 楼 
 文章标题 : Re: 编译fcitx-3.6.2帮忙看看哪里出错??
帖子发表于 : 2009-10-30 23:29 
头像

注册: 2007-09-29 3:09
帖子: 5773
送出感谢: 0 次
接收感谢: 3
FrameMgr.c:29:25: error: X11/Xlibint.h: 没有该文件或目录
FrameMgr.h:32:21: error: X11/Xmd.h: 没有该文件或目录
FrameMgr.h:33:22: error: X11/Xlib.h: 没有该文件或目录

上package.ubuntu.com找吧


_________________
HUNT Unfortunately No Talent...


页首
 用户资料  
 
3 楼 
 文章标题 : Re: 编译fcitx-3.6.2帮忙看看哪里出错??
帖子发表于 : 2009-10-30 23:59 

注册: 2008-08-30 14:51
帖子: 95
送出感谢: 0 次
接收感谢: 0 次
HuntXu 写道:
FrameMgr.c:29:25: error: X11/Xlibint.h: 没有该文件或目录
FrameMgr.h:32:21: error: X11/Xmd.h: 没有该文件或目录
FrameMgr.h:33:22: error: X11/Xlib.h: 没有该文件或目录

上package.ubuntu.com找吧

package.ubuntu.com打不开,怎么办?


页首
 用户资料  
 
4 楼 
 文章标题 : Re: 编译fcitx-3.6.2帮忙看看哪里出错??
帖子发表于 : 2009-10-31 0:02 
头像

注册: 2009-05-20 21:43
帖子: 735
送出感谢: 2
接收感谢: 2
引用:
编译时缺少h文件的自动处理: sudo auto-apt run ./configure

在ubuntuSkills上摘抄的


_________________
http://wonc.me/


页首
 用户资料  
 
5 楼 
 文章标题 : Re: 编译fcitx-3.6.2帮忙看看哪里出错??
帖子发表于 : 2009-12-01 14:12 
头像

注册: 2008-10-17 16:59
帖子: 37
送出感谢: 0 次
接收感谢: 0 次
packages.ubuntu.com


正确的地址应该是这样的


_________________
http://hi.baidu.com/marulon/blog/item/1 ... 27230.html


页首
 用户资料  
 
6 楼 
 文章标题 : Re: 编译fcitx-3.6.2帮忙看看哪里出错??
帖子发表于 : 2010-01-11 23:25 

注册: 2008-04-26 23:27
帖子: 25
送出感谢: 1
接收感谢: 0 次
我的也是这样的,我的是英文环境,我用apt-get装 了个,结果发现xwindows下什么都无法输入,鼠标倒是可以用,目前还不知道怎么恢复,有高人还希望指点下。


页首
 用户资料  
 
显示帖子 :  排序  
发表新帖 回复这个主题  [ 6 篇帖子 ] 

当前时区为 UTC + 8 小时


在线用户

正在浏览此版面的用户:没有注册用户 和 3 位游客


不能 在这个版面发表主题
不能 在这个版面回复主题
不能 在这个版面编辑帖子
不能 在这个版面删除帖子
不能 在这个版面提交附件

前往 :  
本站点为公益性站点,用于推广开源自由软件,由 DiaHosting VPSBudgetVM VPS 提供服务。
我们认为:软件应可免费取得,软件工具在各种语言环境下皆可使用,且不会有任何功能上的差异;
人们应有定制和修改软件的自由,且方式不受限制,只要他们自认为合适。

Powered by phpBB © 2000, 2002, 2005, 2007 phpBB Group
简体中文语系由 王笑宇 翻译