编译snapper出错,谁碰到过同样问题?

编译安装或者制作Deb包
回复
头像
windwiny
帖子: 2254
注册时间: 2007-03-13 17:26
送出感谢: 0
接收感谢: 1 次

编译snapper出错,谁碰到过同样问题?

#1

帖子 windwiny » 2013-04-12 16:13

在 LinuxMint 14(和Ubuntu 12.10是一样的) 编译 snapper(OpenSuse上的btrfs快照管理实用程序)


## 先安装依赖软件包
libtool
libdbus-1-dev
libboost1.50-dev
libboost-thread1.50-dev
libxml2-dev
zlib1g-dev

## 下载源代码、编译

git clone https://github.com/openSUSE/snapper.git
cd snapper

autoreconf -i

./configure
make



make[2]: 正在进入目录 `/home/n1/Downloads/snapper/server'
CXXLD snapperd
/usr/bin/ld: Client.o: undefined reference to symbol '_ZTVN5boost6detail16thread_data_baseE'
/usr/bin/ld: note: '_ZTVN5boost6detail16thread_data_baseE' is defined in DSO /usr/lib/libboost_thread.so.1.50.0 so try adding it to the linker command line
/usr/lib/libboost_thread.so.1.50.0: could not read symbols: Invalid operation
collect2: error: ld returned 1 exit status
make[2]: *** [snapperd] 错误 1
make[2]:正在离开目录 `/home/n1/Downloads/snapper/server'
make[1]: *** [all-recursive] 错误 1
make[1]:正在离开目录 `/home/n1/Downloads/snapper'
make: *** [all] 错误 2


提示找不到 _ZTVN5boost6detail16thread_data_baseE 这个函数,谁碰到过这个问题?? 用 libboost 1.49 和 1.50 试过,还是一样错误
头像
YeLee
论坛版主
帖子: 26408
注册时间: 2008-08-13 8:48
系统: Fundu i64
来自: 东海硇州,一双管钥。
送出感谢: 25 次
接收感谢: 307 次
联系:

Re: 编译snapper出错,谁碰到过同样问题?

#2

帖子 YeLee » 2013-04-12 19:34

感觉像是ld的时候没有加boost_thread吧。 :em01 :em01 :em01
◎当我站在道德的高度上俯视别人的时候,发现自己是多么渺小。
♥执着但不偏激,反对而不排斥,坚决捍卫矛盾体的存在方式。
★★★天气预报★★★
fcitx-yatable一个可以使用的码表输入法
[教程]几个实例攻克软件编译难关
Gentoo Development Guide
字体相关
回复

回到 “编译或打包”