当前时区为 UTC + 8 小时



发表新帖 回复这个主题  [ 1 篇帖子 ] 
作者 内容
1 楼 
 文章标题 : 编译XML Parser出现的问题,请问如何解决?
帖子发表于 : 2008-01-06 11:47 

注册: 2007-08-04 22:09
帖子: 213
系统: ArchLinux
送出感谢: 0 次
接收感谢: 0 次
make[1]: Entering directory `/home/muxueqz/XML-Parser-2.36/Expat'
cc -c -D_REENTRANT -D_GNU_SOURCE -DTHREADS_HAVE_PIDS -DDEBIAN -fno-strict-aliasing -pipe -I/usr/local/include -D_LARGEFILE_SOURCE -D_FILE_OFFSET_BITS=64 -O2 -DVERSION=\"2.36\" -DXS_VERSION=\"2.36\" -fPIC "-I/usr/lib/perl/5.8/CORE" Expat.c
Expat.xs:12:19: error: expat.h: No such file or directory
Expat.xs:60: 错误: syntax error before ‘XML_Parser’
Expat.xs:60: 警告: 结构或联合后没有分号
Expat.xs:78: 错误: syntax error before ‘:’ token
Expat.xs:79: 错误: syntax error before ‘:’ token
Expat.xs:80: 错误: syntax error before ‘:’ token
Expat.xs:106: 错误: syntax error before ‘}’ token
Expat.xs:106: 警告: 数据定义时没有类型或存储类
Expat.xs:111: 错误: syntax error before ‘nsdelim’
Expat.xs:111: 警告: 数据定义时没有类型或存储类
Expat.xs:117: 错误: syntax error before ‘*’ token
Expat.xs:118: 错误: syntax error before ‘*’ token
Expat.xs:194: 错误: syntax error before ‘ms’
Expat.xs:194: 警告: 初始化将指针赋给整数,未作类型转换
Expat.xs:194: 警告: 标量初始值设定项中有多余元素
Expat.xs:194: 警告: (靠近 ‘ms’ 的初始化)
Expat.xs:194: 警告: 标量初始值设定项中有多余元素
Expat.xs:194: 警告: (靠近 ‘ms’ 的初始化)
Expat.xs:194: 警告: 数据定义时没有类型或存储类
Expat.xs:197: 错误: syntax error before ‘parser’
Expat.xs: 在函数 ‘append_error’ 中:
Expat.xs:200: 错误: ‘cbv’ 未声明 (在此函数内第一次使用)
Expat.xs:200: 错误: (即使在一个函数内多次出现,每个未声明的标识符在其
Expat.xs:200: 错误: 所在的函数内只报告一次。)
Expat.xs:203: 错误: syntax error before ‘)’ token
Expat.xs:210: 错误: ‘err’ 未声明 (在此函数内第一次使用)
Expat.xs:213: 错误: ‘parser’ 未声明 (在此函数内第一次使用)
Expat.xs: 在顶层:
Expat.xs:249: 错误: syntax error before ‘*’ token
Expat.xs: 在函数 ‘generate_model’ 中:
Expat.xs:255: 错误: ‘model’ 未声明 (在此函数内第一次使用)
Expat.xs:256: 错误: ‘XML_CQUANT_NONE’ 未声明 (在此函数内第一次使用)
Expat.xs:261: 错误: ‘XML_CTYPE_NAME’ 未声明 (在此函数内第一次使用)
Expat.xs:265: 错误: ‘XML_CTYPE_MIXED’ 未声明 (在此函数内第一次使用)
Expat.xs:266: 错误: ‘XML_CTYPE_CHOICE’ 未声明 (在此函数内第一次使用)
Expat.xs:267: 错误: ‘XML_CTYPE_SEQ’ 未声明 (在此函数内第一次使用)
Expat.xs: 在顶层:
Expat.xs:286: 错误: syntax error before ‘parser’
Expat.xs: 在函数 ‘parse_stream’ 中:
Expat.xs:298: 错误: ‘cbv’ 未声明 (在此函数内第一次使用)
Expat.xs:301: 错误: syntax error before ‘)’ token
Expat.xs:311: 错误: ‘ioref’ 未声明 (在此函数内第一次使用)
Expat.xs:350: 错误: ‘parser’ 未声明 (在此函数内第一次使用)
Expat.xs:350: 警告: 初始化时将整数赋给指针,未作类型转换
Expat.xs: 在函数 ‘characterData’ 中:
Expat.xs:460: 错误: ‘cbv’ 未声明 (在此函数内第一次使用)
Expat.xs:460: 错误: syntax error before ‘)’ token
Expat.xs: 在函数 ‘startElement’ 中:
Expat.xs:480: 错误: ‘cbv’ 未声明 (在此函数内第一次使用)
Expat.xs:480: 错误: syntax error before ‘)’ token
Expat.xs: 在函数 ‘endElement’ 中:
Expat.xs:556: 错误: ‘cbv’ 未声明 (在此函数内第一次使用)
Expat.xs:556: 错误: syntax error before ‘)’ token
Expat.xs: 在函数 ‘processingInstruction’ 中:
Expat.xs:590: 错误: ‘cbv’ 未声明 (在此函数内第一次使用)
Expat.xs:590: 错误: syntax error before ‘)’ token
Expat.xs: 在函数 ‘commenthandle’ 中:
Expat.xs:611: 错误: ‘cbv’ 未声明 (在此函数内第一次使用)
Expat.xs:611: 错误: syntax error before ‘)’ token
Expat.xs: 在函数 ‘startCdata’ 中:
Expat.xs:631: 错误: ‘cbv’ 未声明 (在此函数内第一次使用)
Expat.xs:631: 错误: syntax error before ‘)’ token
Expat.xs: 在函数 ‘endCdata’ 中:
Expat.xs:651: 错误: ‘cbv’ 未声明 (在此函数内第一次使用)
Expat.xs:651: 错误: syntax error before ‘)’ token
Expat.xs: 在顶层:
Expat.xs:668: 错误: syntax error before ‘*’ token
Expat.xs: 在函数 ‘nsStart’ 中:
Expat.xs:670: 错误: ‘cbv’ 未声明 (在此函数内第一次使用)
Expat.xs:670: 错误: syntax error before ‘)’ token
Expat.xs:678: 错误: ‘prefix’ 未声明 (在此函数内第一次使用)
Expat.xs:679: 错误: ‘uri’ 未声明 (在此函数内第一次使用)
Expat.xs: 在顶层:
Expat.xs:688: 错误: syntax error before ‘*’ token
Expat.xs: 在函数 ‘nsEnd’ 中:
Expat.xs:690: 错误: ‘cbv’ 未声明 (在此函数内第一次使用)
Expat.xs:690: 错误: syntax error before ‘)’ token
Expat.xs:698: 错误: ‘prefix’ 未声明 (在此函数内第一次使用)
Expat.xs: 在函数 ‘defaulthandle’ 中:
Expat.xs:710: 错误: ‘cbv’ 未声明 (在此函数内第一次使用)
Expat.xs:710: 错误: syntax error before ‘)’ token
Expat.xs: 在顶层:
Expat.xs:729: 错误: syntax error before ‘XML_Content’
Expat.xs: 在函数 ‘elementDecl’ 中:
Expat.xs:731: 错误: ‘cbv’ 未声明 (在此函数内第一次使用)
Expat.xs:731: 错误: syntax error before ‘)’ token
Expat.xs:738: 错误: ‘model’ 未声明 (在此函数内第一次使用)
Expat.xs:744: 错误: ‘name’ 未声明 (在此函数内第一次使用)
Expat.xs: 在函数 ‘attributeDecl’ 中:
Expat.xs:761: 错误: ‘cbv’ 未声明 (在此函数内第一次使用)
Expat.xs:761: 错误: syntax error before ‘)’ token
Expat.xs: 在函数 ‘entityDecl’ 中:
Expat.xs:802: 错误: ‘cbv’ 未声明 (在此函数内第一次使用)
Expat.xs:802: 错误: syntax error before ‘)’ token
Expat.xs: 在函数 ‘doctypeStart’ 中:
Expat.xs:831: 错误: ‘cbv’ 未声明 (在此函数内第一次使用)
Expat.xs:831: 错误: syntax error before ‘)’ token
Expat.xs: 在函数 ‘doctypeEnd’ 中:
Expat.xs:852: 错误: ‘cbv’ 未声明 (在此函数内第一次使用)
Expat.xs:852: 错误: syntax error before ‘)’ token
Expat.xs: 在函数 ‘xmlDecl’ 中:
Expat.xs:872: 错误: ‘cbv’ 未声明 (在此函数内第一次使用)
Expat.xs:872: 错误: syntax error before ‘)’ token
Expat.xs: 在函数 ‘unparsedEntityDecl’ 中:
Expat.xs:901: 错误: ‘cbv’ 未声明 (在此函数内第一次使用)
Expat.xs:901: 错误: syntax error before ‘)’ token
Expat.xs: 在函数 ‘notationDecl’ 中:
Expat.xs:929: 错误: ‘cbv’ 未声明 (在此函数内第一次使用)
Expat.xs:929: 错误: syntax error before ‘)’ token
Expat.xs: 在顶层:
Expat.xs:960: 错误: syntax error before ‘parser’
Expat.xs: 在函数 ‘externalEntityRef’ 中:
Expat.xs:975: 错误: ‘cbv’ 未声明 (在此函数内第一次使用)
Expat.xs:975: 错误: syntax error before ‘)’ token
Expat.xs:983: 错误: ‘pubid’ 未声明 (在此函数内第一次使用)
Expat.xs:985: 错误: ‘base’ 未声明 (在此函数内第一次使用)
Expat.xs:986: 错误: ‘sysid’ 未声明 (在此函数内第一次使用)
Expat.xs:1002: 错误: ‘parser’ 未声明 (在此函数内第一次使用)
Expat.xs:1004: 错误: ‘XML_Parser’ 未声明 (在此函数内第一次使用)
Expat.xs:1004: 错误: syntax error before ‘entpar’
Expat.xs:1007: 错误: ‘entpar’ 未声明 (在此函数内第一次使用)
Expat.xs: 在顶层:
Expat.xs:1115: 错误: syntax error before ‘XML_Encoding’
Expat.xs: 在函数 ‘unknownEncoding’ 中:
Expat.xs:1123: 错误: ‘name’ 未声明 (在此函数内第一次使用)
Expat.xs:1167: 错误: ‘info’ 未声明 (在此函数内第一次使用)
Expat.xs: 在函数 ‘recString’ 中:
Expat.xs:1185: 错误: ‘cbv’ 未声明 (在此函数内第一次使用)
Expat.xs:1185: 错误: syntax error before ‘)’ token
Expat.xs: 在顶层:
Expat.xs:1196: 错误: syntax error before ‘*’ token
Expat.xs: 在函数 ‘suspend_callbacks’ 中:
Expat.xs:1197: 错误: ‘cbv’ 未声明 (在此函数内第一次使用)
Expat.xs:1199: 错误: ‘XML_CharacterDataHandler’ 未声明 (在此函数内第一次使用)
Expat.xs:1199: 错误: syntax error before numeric constant
Expat.xs:1204: 错误: ‘XML_ProcessingInstructionHandler’ 未声明 (在此函数内第一 次使用)
Expat.xs:1204: 错误: syntax error before numeric constant
Expat.xs:1209: 错误: ‘XML_CommentHandler’ 未声明 (在此函数内第一次使用)
Expat.xs:1209: 错误: syntax error before numeric constant
Expat.xs:1215: 错误: ‘XML_StartCdataSectionHandler’ 未声明 (在此函数内第一次使 用)
Expat.xs:1215: 错误: syntax error before numeric constant
Expat.xs:1221: 错误: ‘XML_UnparsedEntityDeclHandler’ 未声明 (在此函数内第一次使用)
Expat.xs:1221: 错误: syntax error before numeric constant
Expat.xs:1226: 错误: ‘XML_NotationDeclHandler’ 未声明 (在此函数内第一次使用)
Expat.xs:1226: 错误: syntax error before numeric constant
Expat.xs:1231: 错误: ‘XML_ExternalEntityRefHandler’ 未声明 (在此函数内第一次使 用)
Expat.xs:1231: 错误: syntax error before numeric constant
Expat.xs: 在顶层:
Expat.xs:1237: 错误: syntax error before ‘*’ token
Expat.xs: 在函数 ‘resume_callbacks’ 中:
Expat.xs:1238: 错误: ‘cbv’ 未声明 (在此函数内第一次使用)
Expat.c: 在函数 ‘XS_XML__Parser__Expat_ParserCreate’ 中:
Expat.c:1290: 错误: ‘XML_Parser’ 未声明 (在此函数内第一次使用)
Expat.c:1290: 错误: syntax error before ‘RETVAL’
Expat.xs:1279: 错误: ‘cbv’ 未声明 (在此函数内第一次使用)
Expat.xs:1280: 错误: 变量 ‘pep’ 有初始值设定但类型不完全
Expat.xs:1280: 错误: ‘XML_PARAM_ENTITY_PARSING_NEVER’ 未声明 (在此函数内第一次 使用)
Expat.xs:1280: 错误: ‘pep’ 的存储大小未知
Expat.xs:1284: 错误: syntax error before ‘)’ token
Expat.xs:1284: 错误: syntax error before ‘)’ token
Expat.xs:1320: 错误: ‘RETVAL’ 未声明 (在此函数内第一次使用)
Expat.xs:1337: 错误: ‘XML_PARAM_ENTITY_PARSING_UNLESS_STANDALONE’ 未声明 (在此 函数内第一次使用)
Expat.c: 在函数 ‘XS_XML__Parser__Expat_ParserRelease’ 中:
Expat.c:1371: 错误: ‘XML_Parser’ 未声明 (在此函数内第一次使用)
Expat.c:1371: 错误: syntax error before ‘parser’
Expat.xs:1351: 错误: ‘cbv’ 未声明 (在此函数内第一次使用)
Expat.xs:1351: 错误: syntax error before ‘)’ token
Expat.c: 在函数 ‘XS_XML__Parser__Expat_ParserFree’ 中:
Expat.c:1390: 错误: ‘XML_Parser’ 未声明 (在此函数内第一次使用)
Expat.c:1390: 错误: syntax error before ‘parser’
Expat.xs:1361: 错误: ‘cbv’ 未声明 (在此函数内第一次使用)
Expat.xs:1361: 错误: syntax error before ‘)’ token
Expat.xs:1430: 错误: ‘parser’ 未声明 (在此函数内第一次使用)
Expat.c: 在函数 ‘XS_XML__Parser__Expat_ParseString’ 中:
Expat.c:1476: 错误: ‘XML_Parser’ 未声明 (在此函数内第一次使用)
Expat.c:1476: 错误: syntax error before ‘parser’
Expat.xs:1439: 错误: ‘cbv’ 未声明 (在此函数内第一次使用)
Expat.xs:1443: 错误: syntax error before ‘)’ token
Expat.xs:1446: 错误: ‘parser’ 未声明 (在此函数内第一次使用)
Expat.c: 在函数 ‘XS_XML__Parser__Expat_ParseStream’ 中:
Expat.c:1508: 错误: ‘XML_Parser’ 未声明 (在此函数内第一次使用)
Expat.c:1508: 错误: syntax error before ‘parser’
Expat.xs:1463: 错误: ‘cbv’ 未声明 (在此函数内第一次使用)
Expat.xs:1465: 错误: syntax error before ‘)’ token
Expat.xs:1473: 错误: ‘parser’ 未声明 (在此函数内第一次使用)
Expat.c: 在函数 ‘XS_XML__Parser__Expat_ParsePartial’ 中:
Expat.c:1543: 错误: ‘XML_Parser’ 未声明 (在此函数内第一次使用)
Expat.c:1543: 错误: syntax error before ‘parser’
Expat.xs:1488: 错误: ‘cbv’ 未声明 (在此函数内第一次使用)
Expat.xs:1488: 错误: syntax error before ‘)’ token
Expat.xs:1490: 错误: ‘parser’ 未声明 (在此函数内第一次使用)
Expat.c: 在函数 ‘XS_XML__Parser__Expat_ParseDone’ 中:
Expat.c:1571: 错误: ‘XML_Parser’ 未声明 (在此函数内第一次使用)
Expat.c:1571: 错误: syntax error before ‘parser’
Expat.xs:1504: 错误: ‘parser’ 未声明 (在此函数内第一次使用)
Expat.c: 在函数 ‘XS_XML__Parser__Expat_SetStartElementHandler’ 中:
Expat.c:1594: 错误: ‘XML_Parser’ 未声明 (在此函数内第一次使用)
Expat.c:1594: 错误: syntax error before ‘parser’
Expat.xs:1518: 错误: ‘cbv’ 未声明 (在此函数内第一次使用)
Expat.xs:1518: 错误: syntax error before ‘)’ token
Expat.c: 在函数 ‘XS_XML__Parser__Expat_SetEndElementHandler’ 中:
Expat.c:1615: 错误: ‘XML_Parser’ 未声明 (在此函数内第一次使用)
Expat.c:1615: 错误: syntax error before ‘parser’
Expat.xs:1529: 错误: ‘cbv’ 未声明 (在此函数内第一次使用)
Expat.xs:1529: 错误: syntax error before ‘)’ token
Expat.c: 在函数 ‘XS_XML__Parser__Expat_SetCharacterDataHandler’ 中:
Expat.c:1636: 错误: ‘XML_Parser’ 未声明 (在此函数内第一次使用)
Expat.c:1636: 错误: syntax error before ‘parser’
Expat.xs:1540: 错误: ‘XML_CharacterDataHandler’ 未声明 (在此函数内第一次使用)
Expat.xs:1540: 错误: syntax error before ‘charhndl’
Expat.xs:1541: 错误: ‘cbv’ 未声明 (在此函数内第一次使用)
Expat.xs:1541: 错误: syntax error before ‘)’ token
Expat.xs:1545: 错误: ‘charhndl’ 未声明 (在此函数内第一次使用)
Expat.xs:1547: 错误: ‘parser’ 未声明 (在此函数内第一次使用)
Expat.c: 在函数 ‘XS_XML__Parser__Expat_SetProcessingInstructionHandler’ 中:
Expat.c:1663: 错误: ‘XML_Parser’ 未声明 (在此函数内第一次使用)
Expat.c:1663: 错误: syntax error before ‘parser’
Expat.xs:1557: 错误: ‘XML_ProcessingInstructionHandler’ 未声明 (在此函数内第一 次使用)
Expat.xs:1557: 错误: syntax error before ‘prochndl’
Expat.xs:1559: 错误: ‘cbv’ 未声明 (在此函数内第一次使用)
Expat.xs:1559: 错误: syntax error before ‘)’ token
Expat.xs:1563: 错误: ‘prochndl’ 未声明 (在此函数内第一次使用)
Expat.xs:1565: 错误: ‘parser’ 未声明 (在此函数内第一次使用)
Expat.c: 在函数 ‘XS_XML__Parser__Expat_SetCommentHandler’ 中:
Expat.c:1691: 错误: ‘XML_Parser’ 未声明 (在此函数内第一次使用)
Expat.c:1691: 错误: syntax error before ‘parser’
Expat.xs:1575: 错误: ‘XML_CommentHandler’ 未声明 (在此函数内第一次使用)
Expat.xs:1575: 错误: syntax error before ‘cmnthndl’
Expat.xs:1576: 错误: ‘cbv’ 未声明 (在此函数内第一次使用)
Expat.xs:1576: 错误: syntax error before ‘)’ token
Expat.xs:1580: 错误: ‘cmnthndl’ 未声明 (在此函数内第一次使用)
Expat.xs:1582: 错误: ‘parser’ 未声明 (在此函数内第一次使用)
Expat.c: 在函数 ‘XS_XML__Parser__Expat_SetDefaultHandler’ 中:
Expat.c:1718: 错误: ‘XML_Parser’ 未声明 (在此函数内第一次使用)
Expat.c:1718: 错误: syntax error before ‘parser’
Expat.xs:1592: 错误: ‘XML_DefaultHandler’ 未声明 (在此函数内第一次使用)
Expat.xs:1592: 错误: syntax error before ‘dflthndl’
Expat.xs:1593: 错误: ‘cbv’ 未声明 (在此函数内第一次使用)
Expat.xs:1593: 错误: syntax error before ‘)’ token
Expat.xs:1597: 错误: ‘dflthndl’ 未声明 (在此函数内第一次使用)
Expat.xs:1600: 错误: ‘parser’ 未声明 (在此函数内第一次使用)
Expat.c: 在函数 ‘XS_XML__Parser__Expat_SetUnparsedEntityDeclHandler’ 中:
Expat.c:1749: 错误: ‘XML_Parser’ 未声明 (在此函数内第一次使用)
Expat.c:1749: 错误: syntax error before ‘parser’
Expat.xs:1613: 错误: ‘XML_UnparsedEntityDeclHandler’ 未声明 (在此函数内第一次使用)
Expat.xs:1613: 错误: syntax error before ‘unprsdhndl’
Expat.xs:1615: 错误: ‘cbv’ 未声明 (在此函数内第一次使用)
Expat.xs:1615: 错误: syntax error before ‘)’ token
Expat.xs:1619: 错误: ‘unprsdhndl’ 未声明 (在此函数内第一次使用)
Expat.xs:1621: 错误: ‘parser’ 未声明 (在此函数内第一次使用)
Expat.c: 在函数 ‘XS_XML__Parser__Expat_SetNotationDeclHandler’ 中:
Expat.c:1777: 错误: ‘XML_Parser’ 未声明 (在此函数内第一次使用)
Expat.c:1777: 错误: syntax error before ‘parser’
Expat.xs:1631: 错误: ‘XML_NotationDeclHandler’ 未声明 (在此函数内第一次使用)
Expat.xs:1631: 错误: syntax error before ‘nothndlr’
Expat.xs:1632: 错误: ‘cbv’ 未声明 (在此函数内第一次使用)
Expat.xs:1632: 错误: syntax error before ‘)’ token
Expat.xs:1636: 错误: ‘nothndlr’ 未声明 (在此函数内第一次使用)
Expat.xs:1638: 错误: ‘parser’ 未声明 (在此函数内第一次使用)
Expat.c: 在函数 ‘XS_XML__Parser__Expat_SetExternalEntityRefHandler’ 中:
Expat.c:1804: 错误: ‘XML_Parser’ 未声明 (在此函数内第一次使用)
Expat.c:1804: 错误: syntax error before ‘parser’
Expat.xs:1648: 错误: ‘XML_ExternalEntityRefHandler’ 未声明 (在此函数内第一次使 用)
Expat.xs:1648: 错误: syntax error before ‘exthndlr’
Expat.xs:1650: 错误: ‘cbv’ 未声明 (在此函数内第一次使用)
Expat.xs:1650: 错误: syntax error before ‘)’ token
Expat.xs:1654: 错误: ‘exthndlr’ 未声明 (在此函数内第一次使用)
Expat.xs:1656: 错误: ‘parser’ 未声明 (在此函数内第一次使用)
Expat.c: 在函数 ‘XS_XML__Parser__Expat_SetExtEntFinishHandler’ 中:
Expat.c:1832: 错误: ‘XML_Parser’ 未声明 (在此函数内第一次使用)
Expat.c:1832: 错误: syntax error before ‘parser’
Expat.xs:1666: 错误: ‘cbv’ 未声明 (在此函数内第一次使用)
Expat.xs:1666: 错误: syntax error before ‘)’ token
Expat.c: 在函数 ‘XS_XML__Parser__Expat_SetEntityDeclHandler’ 中:
Expat.c:1858: 错误: ‘XML_Parser’ 未声明 (在此函数内第一次使用)
Expat.c:1858: 错误: syntax error before ‘parser’
Expat.xs:1683: 错误: ‘XML_EntityDeclHandler’ 未声明 (在此函数内第一次使用)
Expat.xs:1683: 错误: syntax error before ‘enthndlr’
Expat.xs:1685: 错误: ‘cbv’ 未声明 (在此函数内第一次使用)
Expat.xs:1685: 错误: syntax error before ‘)’ token
Expat.xs:1689: 错误: ‘enthndlr’ 未声明 (在此函数内第一次使用)
Expat.xs:1691: 错误: ‘parser’ 未声明 (在此函数内第一次使用)
Expat.c: 在函数 ‘XS_XML__Parser__Expat_SetElementDeclHandler’ 中:
Expat.c:1886: 错误: ‘XML_Parser’ 未声明 (在此函数内第一次使用)
Expat.c:1886: 错误: syntax error before ‘parser’
Expat.xs:1701: 错误: ‘XML_ElementDeclHandler’ 未声明 (在此函数内第一次使用)
Expat.xs:1701: 错误: syntax error before ‘eldeclhndlr’
Expat.xs:1703: 错误: ‘cbv’ 未声明 (在此函数内第一次使用)
Expat.xs:1703: 错误: syntax error before ‘)’ token
Expat.xs:1707: 错误: ‘eldeclhndlr’ 未声明 (在此函数内第一次使用)
Expat.xs:1709: 错误: ‘parser’ 未声明 (在此函数内第一次使用)
Expat.c: 在函数 ‘XS_XML__Parser__Expat_SetAttListDeclHandler’ 中:
Expat.c:1914: 错误: ‘XML_Parser’ 未声明 (在此函数内第一次使用)
Expat.c:1914: 错误: syntax error before ‘parser’
Expat.xs:1719: 错误: ‘XML_AttlistDeclHandler’ 未声明 (在此函数内第一次使用)
Expat.xs:1719: 错误: syntax error before ‘attdeclhndlr’
Expat.xs:1721: 错误: ‘cbv’ 未声明 (在此函数内第一次使用)
Expat.xs:1721: 错误: syntax error before ‘)’ token
Expat.xs:1725: 错误: ‘attdeclhndlr’ 未声明 (在此函数内第一次使用)
Expat.xs:1727: 错误: ‘parser’ 未声明 (在此函数内第一次使用)
Expat.c: 在函数 ‘XS_XML__Parser__Expat_SetDoctypeHandler’ 中:
Expat.c:1942: 错误: ‘XML_Parser’ 未声明 (在此函数内第一次使用)
Expat.c:1942: 错误: syntax error before ‘parser’
Expat.xs:1737: 错误: ‘XML_StartDoctypeDeclHandler’ 未声明 (在此函数内第一次使用)
Expat.xs:1737: 错误: syntax error before ‘dtsthndlr’
Expat.xs:1739: 错误: ‘cbv’ 未声明 (在此函数内第一次使用)
Expat.xs:1739: 错误: syntax error before ‘)’ token
Expat.xs:1744: 错误: ‘dtsthndlr’ 未声明 (在此函数内第一次使用)
Expat.xs:1746: 错误: ‘parser’ 未声明 (在此函数内第一次使用)
Expat.c: 在函数 ‘XS_XML__Parser__Expat_SetEndDoctypeHandler’ 中:
Expat.c:1971: 错误: ‘XML_Parser’ 未声明 (在此函数内第一次使用)
Expat.c:1971: 错误: syntax error before ‘parser’
Expat.xs:1756: 错误: ‘XML_EndDoctypeDeclHandler’ 未声明 (在此函数内第一次使用)
Expat.xs:1756: 错误: syntax error before ‘dtendhndlr’
Expat.xs:1758: 错误: ‘cbv’ 未声明 (在此函数内第一次使用)
Expat.xs:1758: 错误: syntax error before ‘)’ token
Expat.xs:1762: 错误: ‘dtendhndlr’ 未声明 (在此函数内第一次使用)
Expat.xs:1764: 错误: ‘parser’ 未声明 (在此函数内第一次使用)
Expat.c: 在函数 ‘XS_XML__Parser__Expat_SetXMLDeclHandler’ 中:
Expat.c:1999: 错误: ‘XML_Parser’ 未声明 (在此函数内第一次使用)
Expat.c:1999: 错误: syntax error before ‘parser’
Expat.xs:1775: 错误: ‘XML_XmlDeclHandler’ 未声明 (在此函数内第一次使用)
Expat.xs:1775: 错误: syntax error before ‘xmldechndlr’
Expat.xs:1777: 错误: ‘cbv’ 未声明 (在此函数内第一次使用)
Expat.xs:1777: 错误: syntax error before ‘)’ token
Expat.xs:1781: 错误: ‘xmldechndlr’ 未声明 (在此函数内第一次使用)
Expat.xs:1783: 错误: ‘parser’ 未声明 (在此函数内第一次使用)
Expat.c: 在函数 ‘XS_XML__Parser__Expat_SetBase’ 中:
Expat.c:2027: 错误: ‘XML_Parser’ 未声明 (在此函数内第一次使用)
Expat.c:2027: 错误: syntax error before ‘parser’
Expat.xs:1803: 错误: ‘parser’ 未声明 (在此函数内第一次使用)
Expat.c: 在函数 ‘XS_XML__Parser__Expat_GetBase’ 中:
Expat.c:2054: 错误: ‘XML_Parser’ 未声明 (在此函数内第一次使用)
Expat.c:2054: 错误: syntax error before ‘parser’
Expat.xs:1812: 错误: ‘parser’ 未声明 (在此函数内第一次使用)
Expat.xs:1812: 警告: 初始化时将整数赋给指针,未作类型转换
Expat.c: 在函数 ‘XS_XML__Parser__Expat_PositionContext’ 中:
Expat.c:2080: 错误: ‘XML_Parser’ 未声明 (在此函数内第一次使用)
Expat.c:2080: 错误: syntax error before ‘parser’
Expat.xs:1829: 错误: ‘parser’ 未声明 (在此函数内第一次使用)
Expat.xs:1829: 警告: 初始化时将整数赋给指针,未作类型转换
Expat.c: 在函数 ‘XS_XML__Parser__Expat_DefaultCurrent’ 中:
Expat.c:2194: 错误: ‘XML_Parser’ 未声明 (在此函数内第一次使用)
Expat.c:2194: 错误: syntax error before ‘parser’
Expat.xs:1920: 错误: ‘cbv’ 未声明 (在此函数内第一次使用)
Expat.xs:1920: 错误: syntax error before ‘)’ token
Expat.xs:1922: 错误: ‘parser’ 未声明 (在此函数内第一次使用)
Expat.c: 在函数 ‘XS_XML__Parser__Expat_RecognizedString’ 中:
Expat.c:2213: 错误: ‘XML_Parser’ 未声明 (在此函数内第一次使用)
Expat.c:2213: 错误: syntax error before ‘parser’
Expat.xs:1930: 错误: ‘XML_DefaultHandler’ 未声明 (在此函数内第一次使用)
Expat.xs:1930: 错误: syntax error before ‘dflthndl’
Expat.xs:1931: 错误: ‘cbv’ 未声明 (在此函数内第一次使用)
Expat.xs:1931: 错误: syntax error before ‘)’ token
Expat.xs:1934: 错误: ‘dflthndl’ 未声明 (在此函数内第一次使用)
Expat.xs:1942: 错误: ‘parser’ 未声明 (在此函数内第一次使用)
Expat.c: 在函数 ‘XS_XML__Parser__Expat_GetErrorCode’ 中:
Expat.c:2256: 错误: ‘XML_Parser’ 未声明 (在此函数内第一次使用)
Expat.c:2256: 错误: syntax error before ‘parser’
Expat.c:2260: 错误: ‘parser’ 未声明 (在此函数内第一次使用)
Expat.c: 在函数 ‘XS_XML__Parser__Expat_GetCurrentLineNumber’ 中:
Expat.c:2273: 错误: ‘XML_Parser’ 未声明 (在此函数内第一次使用)
Expat.c:2273: 错误: syntax error before ‘parser’
Expat.c:2277: 错误: ‘parser’ 未声明 (在此函数内第一次使用)
Expat.c: 在函数 ‘XS_XML__Parser__Expat_GetCurrentColumnNumber’ 中:
Expat.c:2290: 错误: ‘XML_Parser’ 未声明 (在此函数内第一次使用)
Expat.c:2290: 错误: syntax error before ‘parser’
Expat.c:2294: 错误: ‘parser’ 未声明 (在此函数内第一次使用)
Expat.c: 在函数 ‘XS_XML__Parser__Expat_GetCurrentByteIndex’ 中:
Expat.c:2307: 错误: ‘XML_Parser’ 未声明 (在此函数内第一次使用)
Expat.c:2307: 错误: syntax error before ‘parser’
Expat.c:2311: 错误: ‘parser’ 未声明 (在此函数内第一次使用)
Expat.c: 在函数 ‘XS_XML__Parser__Expat_GetSpecifiedAttributeCount’ 中:
Expat.c:2324: 错误: ‘XML_Parser’ 未声明 (在此函数内第一次使用)
Expat.c:2324: 错误: syntax error before ‘parser’
Expat.c:2328: 错误: ‘parser’ 未声明 (在此函数内第一次使用)
Expat.xs: 在函数 ‘XS_XML__Parser__Expat_ErrorString’ 中:
Expat.xs:1983: 警告: 初始化时将整数赋给指针,未作类型转换
Expat.c: 在函数 ‘XS_XML__Parser__Expat_OriginalString’ 中:
Expat.c:2484: 错误: ‘XML_Parser’ 未声明 (在此函数内第一次使用)
Expat.c:2484: 错误: syntax error before ‘parser’
Expat.xs:2091: 错误: ‘parser’ 未声明 (在此函数内第一次使用)
Expat.xs:2091: 警告: 初始化时将整数赋给指针,未作类型转换
Expat.c: 在函数 ‘XS_XML__Parser__Expat_SetStartCdataHandler’ 中:
Expat.c:2512: 错误: ‘XML_Parser’ 未声明 (在此函数内第一次使用)
Expat.c:2512: 错误: syntax error before ‘parser’
Expat.xs:2109: 错误: ‘cbv’ 未声明 (在此函数内第一次使用)
Expat.xs:2109: 错误: syntax error before ‘)’ token
Expat.xs:2110: 错误: ‘XML_StartCdataSectionHandler’ 未声明 (在此函数内第一次使 用)
Expat.xs:2115: 错误: ‘scdhndl’ 未声明 (在此函数内第一次使用)
Expat.xs:2117: 错误: ‘parser’ 未声明 (在此函数内第一次使用)
Expat.c: 在函数 ‘XS_XML__Parser__Expat_SetEndCdataHandler’ 中:
Expat.c:2540: 错误: ‘XML_Parser’ 未声明 (在此函数内第一次使用)
Expat.c:2540: 错误: syntax error before ‘parser’
Expat.xs:2127: 错误: ‘cbv’ 未声明 (在此函数内第一次使用)
Expat.xs:2127: 错误: syntax error before ‘)’ token
Expat.xs:2128: 错误: ‘XML_EndCdataSectionHandler’ 未声明 (在此函数内第一次使用)Expat.xs:2133: 错误: ‘ecdhndl’ 未声明 (在此函数内第一次使用)
Expat.xs:2135: 错误: ‘parser’ 未声明 (在此函数内第一次使用)
Expat.c: 在函数 ‘XS_XML__Parser__Expat_UnsetAllHandlers’ 中:
Expat.c:2568: 错误: ‘XML_Parser’ 未声明 (在此函数内第一次使用)
Expat.c:2568: 错误: syntax error before ‘parser’
Expat.xs:2144: 错误: ‘cbv’ 未声明 (在此函数内第一次使用)
Expat.xs:2144: 错误: syntax error before ‘)’ token
Expat.xs:2149: 错误: ‘XML_StartNamespaceDeclHandler’ 未声明 (在此函数内第一次使用)
Expat.xs:2149: 错误: syntax error before numeric constant
Expat.xs:2153: 错误: ‘parser’ 未声明 (在此函数内第一次使用)
Expat.xs:2154: 错误: ‘XML_StartElementHandler’ 未声明 (在此函数内第一次使用)
Expat.xs:2154: 错误: syntax error before numeric constant
Expat.xs:2158: 错误: ‘XML_UnknownEncodingHandler’ 未声明 (在此函数内第一次使用)Expat.xs:2158: 错误: syntax error before numeric constant
Expat.c: 在函数 ‘XS_XML__Parser__Expat_ElementIndex’ 中:
Expat.c:2600: 错误: ‘XML_Parser’ 未声明 (在此函数内第一次使用)
Expat.c:2600: 错误: syntax error before ‘parser’
Expat.xs:2167: 错误: ‘cbv’ 未声明 (在此函数内第一次使用)
Expat.xs:2167: 错误: syntax error before ‘)’ token
Expat.c: 在函数 ‘XS_XML__Parser__Expat_SkipUntil’ 中:
Expat.c:2621: 错误: ‘XML_Parser’ 未声明 (在此函数内第一次使用)
Expat.c:2621: 错误: syntax error before ‘parser’
Expat.xs:2179: 错误: ‘cbv’ 未声明 (在此函数内第一次使用)
Expat.xs:2179: 错误: syntax error before ‘)’ token
Expat.c: 在函数 ‘XS_XML__Parser__Expat_Do_External_Parse’ 中:
Expat.c:2643: 错误: ‘XML_Parser’ 未声明 (在此函数内第一次使用)
Expat.c:2643: 错误: syntax error before ‘parser’
Expat.xs:2194: 错误: ‘cbv’ 未声明 (在此函数内第一次使用)
Expat.xs:2194: 错误: syntax error before ‘)’ token
Expat.xs:2197: 错误: ‘parser’ 未声明 (在此函数内第一次使用)
make[1]: *** [Expat.o] 错误 1
make[1]: Leaving directory `/home/muxueqz/XML-Parser-2.36/Expat'
make: *** [subdirs] 错误 2


页首
 用户资料  
 
显示帖子 :  排序  
发表新帖 回复这个主题  [ 1 篇帖子 ] 

当前时区为 UTC + 8 小时


在线用户

正在浏览此版面的用户:没有注册用户 和 1 位游客


不能 在这个版面发表主题
不能 在这个版面回复主题
不能 在这个版面编辑帖子
不能 在这个版面删除帖子
不能 在这个版面提交附件

前往 :  
本站点为公益性站点,用于推广开源自由软件,由 DiaHosting VPSBudgetVM VPS 提供服务。
我们认为:软件应可免费取得,软件工具在各种语言环境下皆可使用,且不会有任何功能上的差异;
人们应有定制和修改软件的自由,且方式不受限制,只要他们自认为合适。

Powered by phpBB © 2000, 2002, 2005, 2007 phpBB Group
简体中文语系由 王笑宇 翻译