当前时区为 UTC + 8 小时



发表新帖 回复这个主题  [ 1 篇帖子 ] 
作者 内容
1 楼 
 文章标题 : 摄像头的安装问题
帖子发表于 : 2008-11-04 20:52 

注册: 2008-06-10 11:00
帖子: 16
送出感谢: 0 次
接收感谢: 0 次
用lsusb查出我的摄像头是
引用:
ID 0ac8:303b Z-Star Microelectronics Corp. ZC0303 WebCam

另外其在cheese和Ekiga下能够正常工作。不过在amsn上图像就是漆黑一片了,用skype也检测不出来。
这说明我的摄像头到底算不算正常工作了呢,需不需要另外安装驱动呢。

我自己也试过在源里下载gscpa-source,可是编译过程中出现了问题,不知道如何解决。
代码:
dh_testdir
dh_testroot
dh_clean
/usr/bin/make -C /usr/src/modules/gspca clean
make[1]: 正在进入目录 `/usr/src/modules/gspca'
rm -r -f *.o decoder/.gspcadecoder.o.cmd decoder/*.o \
   .gspca.o.cmd  *.o *.ko *.mod.* .[a-z]* core *.i \
   *.symvers *.err
make[1]:正在离开目录 `/usr/src/modules/gspca'
/usr/bin/make  -f debian/rules kdist_clean kdist_config binary-modules
make[1]: 正在进入目录 `/usr/src/modules/gspca'
dh_testdir
dh_testroot
dh_clean
/usr/bin/make -C /usr/src/modules/gspca clean
make[2]: 正在进入目录 `/usr/src/modules/gspca'
rm -r -f *.o decoder/.gspcadecoder.o.cmd decoder/*.o \
   .gspca.o.cmd  *.o *.ko *.mod.* .[a-z]* core *.i \
   *.symvers *.err
make[2]:正在离开目录 `/usr/src/modules/gspca'
for templ in ; do \
    cp $templ `echo $templ | sed -e 's/_KVERS_/2.6.27-7-generic/g'` ; \
  done
for templ in `ls debian/*.modules.in` ; do \
    test -e ${templ%.modules.in}.backup || cp ${templ%.modules.in} ${templ%.modules.in}.backup 2>/dev/null || true; \
    sed -e 's/##KVERS##/2.6.27-7-generic/g ;s/#KVERS#/2.6.27-7-generic/g ; s/_KVERS_/2.6.27-7-generic/g ; s/##KDREV##/2.6.27-7.15/g ; s/#KDREV#/2.6.27-7.15/g ; s/_KDREV_/2.6.27-7.15/g  ' < $templ > ${templ%.modules.in}; \
  done
dh_testdir
dh_testroot
dh_clean -k
# Build the module
/usr/bin/make -C /usr/src/modules/gspca KERNEL_VERSION=2.6.27-7-generic KERNELDIR=/usr/src/linux-headers-2.6.27-7-generic
make[2]: 正在进入目录 `/usr/src/modules/gspca'
/usr/bin/make -C /usr/src/linux-headers-2.6.27-7-generic SUBDIRS=/usr/src/modules/gspca CC=gcc modules
make[3]: 正在进入目录 `/usr/src/linux-headers-2.6.27-7-generic'
  CC [M]  /usr/src/modules/gspca/gspca_core.o
/usr/src/modules/gspca/gspca_core.c:54:27: error: asm/semaphore.h: 没有该文件或目录
/usr/src/modules/gspca/gspca_core.c: 在函数‘spca5xx_ioctl’中:
/usr/src/modules/gspca/gspca_core.c:2463: 错误: 隐式声明函数‘video_usercopy’
/usr/src/modules/gspca/gspca_core.c: 在文件层:
/usr/src/modules/gspca/gspca_core.c:2609: 错误: 初始值设定项里有未知的字段‘owner’
/usr/src/modules/gspca/gspca_core.c:2609: 警告: 从不兼容的指针类型初始化
/usr/src/modules/gspca/gspca_core.c:2611: 错误: 初始值设定项里有未知的字段‘type’
/usr/src/modules/gspca/gspca_core.c: 在函数‘spca50x_create_sysfs’中:
/usr/src/modules/gspca/gspca_core.c:2769: 错误: 隐式声明函数‘video_device_create_file’
/usr/src/modules/gspca/gspca_core.c:2780: 错误: 隐式声明函数‘video_device_remove_file’
/usr/src/modules/gspca/gspca_core.c: 在函数‘spca5xx_probe’中:
/usr/src/modules/gspca/gspca_core.c:4301: 错误: 赋值时类型不兼容
make[4]: *** [/usr/src/modules/gspca/gspca_core.o] 错误 1
make[3]: *** [_module_/usr/src/modules/gspca] 错误 2
make[3]:正在离开目录 `/usr/src/linux-headers-2.6.27-7-generic'
make[2]: *** [default] 错误 2
make[2]:正在离开目录 `/usr/src/modules/gspca'
make[1]: *** [binary-modules] 错误 2
make[1]:正在离开目录 `/usr/src/modules/gspca'
make: *** [kdist_build] 错误 2


还请达人指教,谢谢。


页首
 用户资料  
 
显示帖子 :  排序  
发表新帖 回复这个主题  [ 1 篇帖子 ] 

当前时区为 UTC + 8 小时


在线用户

正在浏览此版面的用户:没有注册用户 和 1 位游客


不能 在这个版面发表主题
不能 在这个版面回复主题
不能 在这个版面编辑帖子
不能 在这个版面删除帖子
不能 在这个版面提交附件

前往 :  
本站点为公益性站点,用于推广开源自由软件,由 DiaHosting VPSBudgetVM VPS 提供服务。
我们认为:软件应可免费取得,软件工具在各种语言环境下皆可使用,且不会有任何功能上的差异;
人们应有定制和修改软件的自由,且方式不受限制,只要他们自认为合适。

Powered by phpBB © 2000, 2002, 2005, 2007 phpBB Group
简体中文语系由 王笑宇 翻译