当前时区为 UTC + 8 小时



发表新帖 回复这个主题  [ 7 篇帖子 ] 
作者 内容
1 楼 
 文章标题 : make xconfig 错误
帖子发表于 : 2010-07-07 13:30 
头像

注册: 2008-04-27 12:15
帖子: 1026
送出感谢: 0 次
接收感谢: 0 次
尝试编译内核,但是 make xconfig 这个步骤就不会了
引用:
$ make xconfig
HOSTCXX scripts/kconfig/qconf.o
scripts/kconfig/qconf.cc:7:26: error: q3mainwindow.h: 没有那个文件或目录
scripts/kconfig/qconf.cc:9:23: error: q3toolbar.h: 没有那个文件或目录
scripts/kconfig/qconf.cc:11:20: error: q3vbox.h: 没有那个文件或目录
scripts/kconfig/qconf.cc:13:24: error: q3listview.h: 没有那个文件或目录
scripts/kconfig/qconf.cc:14:27: error: q3textbrowser.h: 没有那个文件或目录
scripts/kconfig/qconf.cc:21:22: error: q3header.h: 没有那个文件或目录
scripts/kconfig/qconf.cc:22:26: error: q3filedialog.h: 没有那个文件或目录
scripts/kconfig/qconf.cc:23:26: error: q3dragobject.h: 没有那个文件或目录
scripts/kconfig/qconf.cc:26:29: error: QContextMenuEvent: 没有那个文件或目录
scripts/kconfig/qconf.cc:27:19: error: QPixmap: 没有那个文件或目录
scripts/kconfig/qconf.cc:28:23: error: QFocusEvent: 没有那个文件或目录
scripts/kconfig/qconf.cc:29:23: error: QMouseEvent: 没有那个文件或目录
scripts/kconfig/qconf.cc:30:23: error: QCloseEvent: 没有那个文件或目录
scripts/kconfig/qconf.cc:31:23: error: Q3ValueList: 没有那个文件或目录
scripts/kconfig/qconf.cc:32:21: error: QKeyEvent: 没有那个文件或目录
scripts/kconfig/qconf.cc:33:24: error: Q3HBoxLayout: 没有那个文件或目录
scripts/kconfig/qconf.cc:34:24: error: Q3VBoxLayout: 没有那个文件或目录
scripts/kconfig/qconf.cc:35:23: error: Q3PopupMenu: 没有那个文件或目录
In file included from scripts/kconfig/qconf.cc:40:
scripts/kconfig/qconf.h:46: error: ISO C++ forbids declaration of ‘Q3ValueList’ with no type
scripts/kconfig/qconf.h:46: error: expected ‘;’ before ‘<’ token
scripts/kconfig/qconf.h:47: error: ISO C++ forbids declaration of ‘Q3ValueList’ with no type
scripts/kconfig/qconf.h:47: error: expected ‘,’ or ‘...’ before ‘<’ token
scripts/kconfig/qconf.h:57: error: expected class-name before ‘{’ token
scripts/kconfig/qconf.h:141: error: ISO C++ forbids declaration of ‘Q3PopupMenu’ with no type
scripts/kconfig/qconf.h:141: error: expected ‘;’ before ‘*’ token
scripts/kconfig/qconf.h: In member function ‘ConfigView* ConfigList::parent() const’:
scripts/kconfig/qconf.h:65: error: incomplete type ‘Q3ListView’ used in nested name specifier
scripts/kconfig/qconf.h: In member function ‘ConfigItem* ConfigList::firstChild() const’:
scripts/kconfig/qconf.h:105: error: incomplete type ‘Q3ListView’ used in nested name specifier
scripts/kconfig/qconf.h: In member function ‘void ConfigList::addColumn(colIdx, const QString&)’:
scripts/kconfig/qconf.h:113: error: incomplete type ‘Q3ListView’ used in nested name specifier
scripts/kconfig/qconf.h: In member function ‘void ConfigList::removeColumn(colIdx)’:
scripts/kconfig/qconf.h:120: error: incomplete type ‘Q3ListView’ used in nested name specifier
scripts/kconfig/qconf.h: At global scope:
scripts/kconfig/qconf.h:148: error: expected class-name before ‘{’ token
scripts/kconfig/qconf.h: In constructor ‘ConfigItem::ConfigItem(Q3ListView*, ConfigItem*, KCMenu*, bool)’:
scripts/kconfig/qconf.h:152: error: type ‘Q3ListViewItem’ is not a direct base of ‘ConfigItem’
scripts/kconfig/qconf.h: In constructor ‘ConfigItem::ConfigItem(ConfigItem*, ConfigItem*, KCMenu*, bool)’:
scripts/kconfig/qconf.h:157: error: type ‘Q3ListViewItem’ is not a direct base of ‘ConfigItem’
scripts/kconfig/qconf.h: In constructor ‘ConfigItem::ConfigItem(Q3ListView*, ConfigItem*, bool)’:
scripts/kconfig/qconf.h:162: error: type ‘Q3ListViewItem’ is not a direct base of ‘ConfigItem’
scripts/kconfig/qconf.h: In member function ‘ConfigList* ConfigItem::listView() const’:
scripts/kconfig/qconf.h:175: error: incomplete type ‘Q3ListViewItem’ used in nested name specifier
scripts/kconfig/qconf.h: In member function ‘ConfigItem* ConfigItem::firstChild() const’:
scripts/kconfig/qconf.h:179: error: incomplete type ‘Q3ListViewItem’ used in nested name specifier
scripts/kconfig/qconf.h: In member function ‘ConfigItem* ConfigItem::nextSibling() const’:
scripts/kconfig/qconf.h:183: error: incomplete type ‘Q3ListViewItem’ used in nested name specifier
scripts/kconfig/qconf.h: In member function ‘void ConfigItem::setText(colIdx, const QString&)’:
scripts/kconfig/qconf.h:187: error: incomplete type ‘Q3ListViewItem’ used in nested name specifier
scripts/kconfig/qconf.h: In member function ‘QString ConfigItem::text(colIdx) const’:
scripts/kconfig/qconf.h:191: error: incomplete type ‘Q3ListViewItem’ used in nested name specifier
scripts/kconfig/qconf.h: In member function ‘void ConfigItem::setPixmap(colIdx, const QPixmap&)’:
scripts/kconfig/qconf.h:195: error: incomplete type ‘Q3ListViewItem’ used in nested name specifier
scripts/kconfig/qconf.h: In member function ‘const QPixmap* ConfigItem::pixmap(colIdx) const’:
scripts/kconfig/qconf.h:199: error: incomplete type ‘Q3ListViewItem’ used in nested name specifier
scripts/kconfig/qconf.h: At global scope:
scripts/kconfig/qconf.h:225: error: expected class-name before ‘{’ token
scripts/kconfig/qconf.h:256: error: expected class-name before ‘{’ token
scripts/kconfig/qconf.h:279: error: ISO C++ forbids declaration of ‘Q3PopupMenu’ with no type
scripts/kconfig/qconf.h:279: error: expected ‘;’ before ‘*’ token
scripts/kconfig/qconf.h:307: error: expected class-name before ‘{’ token
scripts/kconfig/qconf.h:339: error: ISO C++ forbids declaration of ‘Q3ToolBar’ with no type
scripts/kconfig/qconf.h:339: error: expected ‘;’ before ‘*’ token
In file included from scripts/kconfig/qconf.cc:42:
scripts/kconfig/qconf.moc: In static member function ‘static QMetaObject* ConfigList::staticMetaObject()’:
scripts/kconfig/qconf.moc:52: error: incomplete type ‘Q3ListView’ used in nested name specifier
scripts/kconfig/qconf.moc: In member function ‘virtual void* ConfigList::qt_cast(const char*)’:
scripts/kconfig/qconf.moc:116: error: incomplete type ‘Q3ListView’ used in nested name specifier
In file included from scripts/kconfig/qconf.cc:42:
scripts/kconfig/qconf.moc: In member function ‘void ConfigList::menuChanged(KCMenu*)’:
scripts/kconfig/qconf.moc:125: error: ‘signalsBlocked’ was not declared in this scope
scripts/kconfig/qconf.moc:127: error: ‘receivers’ was not declared in this scope
scripts/kconfig/qconf.moc:132: error: ‘activate_signal’ was not declared in this scope
scripts/kconfig/qconf.moc: In member function ‘void ConfigList::menuSelected(KCMenu*)’:
scripts/kconfig/qconf.moc:138: error: ‘signalsBlocked’ was not declared in this scope
scripts/kconfig/qconf.moc:140: error: ‘receivers’ was not declared in this scope
scripts/kconfig/qconf.moc:145: error: ‘activate_signal’ was not declared in this scope
scripts/kconfig/qconf.moc: In member function ‘void ConfigList::parentSelected()’:
scripts/kconfig/qconf.moc:151: error: ‘activate_signal’ was not declared in this scope
scripts/kconfig/qconf.moc: In member function ‘void ConfigList::gotFocus(KCMenu*)’:
scripts/kconfig/qconf.moc:157: error: ‘signalsBlocked’ was not declared in this scope
scripts/kconfig/qconf.moc:159: error: ‘receivers’ was not declared in this scope
scripts/kconfig/qconf.moc:164: error: ‘activate_signal’ was not declared in this scope
scripts/kconfig/qconf.moc: In member function ‘virtual bool ConfigList::qt_invoke(int, QUObject*)’:
scripts/kconfig/qconf.moc:177: error: incomplete type ‘Q3ListView’ used in nested name specifier
scripts/kconfig/qconf.moc: In member function ‘virtual bool ConfigList::qt_emit(int, QUObject*)’:
scripts/kconfig/qconf.moc:190: error: incomplete type ‘Q3ListView’ used in nested name specifier
scripts/kconfig/qconf.moc: In member function ‘virtual bool ConfigList::qt_property(int, int, QVariant*)’:
scripts/kconfig/qconf.moc:198: error: incomplete type ‘Q3ListView’ used in nested name specifier
scripts/kconfig/qconf.moc: In static member function ‘static QMetaObject* ConfigView::staticMetaObject()’:
scripts/kconfig/qconf.moc:310: error: incomplete type ‘Q3VBox’ used in nested name specifier
scripts/kconfig/qconf.moc: In member function ‘virtual void* ConfigView::qt_cast(const char*)’:
scripts/kconfig/qconf.moc:372: error: incomplete type ‘Q3VBox’ used in nested name specifier
scripts/kconfig/qconf.moc: In member function ‘void ConfigView::showAllChanged(bool)’:
scripts/kconfig/qconf.moc:378: error: ‘activate_signal_bool’ was not declared in this scope
scripts/kconfig/qconf.moc: In member function ‘void ConfigView::showNameChanged(bool)’:
scripts/kconfig/qconf.moc:384: error: ‘activate_signal_bool’ was not declared in this scope
scripts/kconfig/qconf.moc: In member function ‘void ConfigView::showRangeChanged(bool)’:
scripts/kconfig/qconf.moc:390: error: ‘activate_signal_bool’ was not declared in this scope
scripts/kconfig/qconf.moc: In member function ‘void ConfigView::showDataChanged(bool)’:
scripts/kconfig/qconf.moc:396: error: ‘activate_signal_bool’ was not declared in this scope
scripts/kconfig/qconf.moc: In member function ‘virtual bool ConfigView::qt_invoke(int, QUObject*)’:
scripts/kconfig/qconf.moc:407: error: incomplete type ‘Q3VBox’ used in nested name specifier
scripts/kconfig/qconf.moc: In member function ‘virtual bool ConfigView::qt_emit(int, QUObject*)’:
scripts/kconfig/qconf.moc:420: error: incomplete type ‘Q3VBox’ used in nested name specifier
scripts/kconfig/qconf.moc: In member function ‘virtual bool ConfigView::qt_property(int, int, QVariant*)’:
scripts/kconfig/qconf.moc:428: error: incomplete type ‘Q3VBox’ used in nested name specifier
scripts/kconfig/qconf.moc: In static member function ‘static QMetaObject* ConfigInfoView::staticMetaObject()’:
scripts/kconfig/qconf.moc:467: error: incomplete type ‘Q3TextBrowser’ used in nested name specifier
scripts/kconfig/qconf.moc: In member function ‘virtual void* ConfigInfoView::qt_cast(const char*)’:
scripts/kconfig/qconf.moc:516: error: incomplete type ‘Q3TextBrowser’ used in nested name specifier
scripts/kconfig/qconf.moc: In member function ‘void ConfigInfoView::showDebugChanged(bool)’:
scripts/kconfig/qconf.moc:522: error: ‘activate_signal_bool’ was not declared in this scope
scripts/kconfig/qconf.moc: In member function ‘void ConfigInfoView::menuSelected(KCMenu*)’:
scripts/kconfig/qconf.moc:528: error: ‘signalsBlocked’ was not declared in this scope
scripts/kconfig/qconf.moc:530: error: ‘receivers’ was not declared in this scope
scripts/kconfig/qconf.moc:535: error: ‘activate_signal’ was not declared in this scope
scripts/kconfig/qconf.moc: In member function ‘virtual bool ConfigInfoView::qt_invoke(int, QUObject*)’:
scripts/kconfig/qconf.moc:546: error: incomplete type ‘Q3TextBrowser’ used in nested name specifier
scripts/kconfig/qconf.moc: In member function ‘virtual bool ConfigInfoView::qt_emit(int, QUObject*)’:
scripts/kconfig/qconf.moc:557: error: incomplete type ‘Q3TextBrowser’ used in nested name specifier
scripts/kconfig/qconf.moc: In member function ‘virtual bool ConfigInfoView::qt_property(int, int, QVariant*)’:
scripts/kconfig/qconf.moc:565: error: incomplete type ‘Q3TextBrowser’ used in nested name specifier
scripts/kconfig/qconf.moc: In static member function ‘static QMetaObject* ConfigMainWindow::staticMetaObject()’:
scripts/kconfig/qconf.moc:689: error: ‘Q3MainWindow’ has not been declared
scripts/kconfig/qconf.moc: In member function ‘virtual void* ConfigMainWindow::qt_cast(const char*)’:
scripts/kconfig/qconf.moc:743: error: ‘Q3MainWindow’ has not been declared
scripts/kconfig/qconf.moc: In member function ‘virtual bool ConfigMainWindow::qt_invoke(int, QUObject*)’:
scripts/kconfig/qconf.moc:764: error: ‘Q3MainWindow’ has not been declared
scripts/kconfig/qconf.moc: In member function ‘virtual bool ConfigMainWindow::qt_emit(int, QUObject*)’:
scripts/kconfig/qconf.moc:771: error: ‘Q3MainWindow’ has not been declared
scripts/kconfig/qconf.moc: In member function ‘virtual bool ConfigMainWindow::qt_property(int, int, QVariant*)’:
scripts/kconfig/qconf.moc:777: error: ‘Q3MainWindow’ has not been declared
scripts/kconfig/qconf.cc: At global scope:
scripts/kconfig/qconf.cc:68: error: expected constructor, destructor, or type conversion before ‘<’ token
make[1]: *** [scripts/kconfig/qconf.o] 错误 1
make: *** [xconfig] 错误 2


_________________
oneleaf 的教导记心间:《学习linux几点忠告》


页首
 用户资料  
 
2 楼 
 文章标题 : Re: make xconfig 错误
帖子发表于 : 2010-07-07 13:43 
头像

注册: 2008-04-27 12:15
帖子: 1026
送出感谢: 0 次
接收感谢: 0 次
make gconfig 也不行
引用:
$ make gconfig
HOSTCC scripts/basic/fixdep
HOSTCC scripts/basic/docproc
HOSTCC scripts/basic/hash
*
* Unable to find the GTK+ installation. Please make sure that
* the GTK+ 2.0 development package is correctly installed...
* You need gtk+-2.0, glib-2.0 and libglade-2.0.
*
HOSTCC scripts/kconfig/conf.o
scripts/kconfig/conf.c: In function ‘conf_askvalue’:
scripts/kconfig/conf.c:105: warning: ignoring return value of ‘fgets’, declared with attribute warn_unused_result
scripts/kconfig/conf.c: In function ‘conf_choice’:
scripts/kconfig/conf.c:307: warning: ignoring return value of ‘fgets’, declared with attribute warn_unused_result
make[1]: *** 没有规则可以创建“scripts/kconfig/gconf.o”需要的目标“scripts/kconfig/.tmp_gtkcheck”。 停止。
make: *** [gconfig] 错误 2


_________________
oneleaf 的教导记心间:《学习linux几点忠告》


页首
 用户资料  
 
3 楼 
 文章标题 : Re: make xconfig 错误
帖子发表于 : 2010-07-07 13:48 
头像

注册: 2008-03-25 15:49
帖子: 25878
地址: 谁知道?
送出感谢: 8
接收感谢: 10
一直make menuconfig


页首
 用户资料  
 
4 楼 
 文章标题 : Re: make xconfig 错误
帖子发表于 : 2010-07-07 13:57 

注册: 2010-07-07 13:46
帖子: 2
送出感谢: 0 次
接收感谢: 0 次
在线的朋友有没有航专的?


页首
 用户资料  
 
5 楼 
 文章标题 : Re: make xconfig 错误
帖子发表于 : 2010-07-08 0:26 
头像

注册: 2009-03-14 16:31
帖子: 645
地址: 不在故乡的地方
送出感谢: 0 次
接收感谢: 2
缺包吧。


_________________
Only the dead have seen the end of war!


页首
 用户资料  
 
6 楼 
 文章标题 : Re: make xconfig 错误
帖子发表于 : 2010-07-08 0:29 
头像

注册: 2009-05-13 14:31
帖子: 449
送出感谢: 0 次
接收感谢: 0 次
sudo 看看


_________________
代码:
御风而行


页首
 用户资料  
 
7 楼 
 文章标题 : Re: make xconfig 错误
帖子发表于 : 2010-07-08 0:42 
头像

注册: 2008-04-27 12:15
帖子: 1026
送出感谢: 0 次
接收感谢: 0 次
问题已经解决了,不过现在问题更多……


_________________
oneleaf 的教导记心间:《学习linux几点忠告》


页首
 用户资料  
 
显示帖子 :  排序  
发表新帖 回复这个主题  [ 7 篇帖子 ] 

当前时区为 UTC + 8 小时


在线用户

正在浏览此版面的用户:没有注册用户 和 2 位游客


不能 在这个版面发表主题
不能 在这个版面回复主题
不能 在这个版面编辑帖子
不能 在这个版面删除帖子
不能 在这个版面提交附件

前往 :  
本站点为公益性站点,用于推广开源自由软件,由 DiaHosting VPSBudgetVM VPS 提供服务。
我们认为:软件应可免费取得,软件工具在各种语言环境下皆可使用,且不会有任何功能上的差异;
人们应有定制和修改软件的自由,且方式不受限制,只要他们自认为合适。

Powered by phpBB © 2000, 2002, 2005, 2007 phpBB Group
简体中文语系由 王笑宇 翻译