当前时区为 UTC + 8 小时



发表新帖 回复这个主题  [ 1 篇帖子 ] 
作者 内容
1 楼 
 文章标题 : ubuntu安装mysql问题!
帖子发表于 : 2009-09-28 10:20 

注册: 2009-09-28 10:18
帖子: 7
送出感谢: 0 次
接收感谢: 0 次
安装到make && make install 出以下错误,刚刚完linux啥都不懂麻烦高人指定,谢谢!


mysql.cc:1041: 错误: expected constructor, destructor, or type conversion before ‘*’ token
mysql.cc: In function ‘int not_in_history(const char*)’:
mysql.cc:2362: 错误: ‘HIST_ENTRY’在此作用域中尚未声明
mysql.cc:2362: 错误: ‘oldhist’在此作用域中尚未声明
mysql.cc:2362: 错误: ‘history_get’在此作用域中尚未声明
mysql.cc: In function ‘void initialize_readline(char*)’:
mysql.cc:2384: 错误: 从类型‘char** (*)()’到类型‘char** (*)(const char*, int, int)’的转换无效
mysql.cc:2385: 错误: 从类型‘int (*)(const char*, int)’到类型‘char* (*)(const char*, int)’的转换无效
mysql.cc: In function ‘char** new_mysql_completion(const char*, int, int)’:
mysql.cc:2407: 错误: ‘completion_matches’在此作用域中尚未声明
mysql.cc: In function ‘int com_edit(String*, char*)’:
mysql.cc:3762: 警告: 忽略声明有 warn_unused_result 属性的‘int system(const char*)’的返回值
make[2]: *** [mysql.o] 错误 1
make[2]:正在离开目录 `/home/testlinux/mysql-5.1.34/client'
make[1]: *** [all] 错误 2
make[1]:正在离开目录 `/home/testlinux/mysql-5.1.34/client'
make: *** [all-recursive] 错误 1


页首
 用户资料  
 
显示帖子 :  排序  
发表新帖 回复这个主题  [ 1 篇帖子 ] 

当前时区为 UTC + 8 小时


在线用户

正在浏览此版面的用户:没有注册用户 和 1 位游客


不能 在这个版面发表主题
不能 在这个版面回复主题
不能 在这个版面编辑帖子
不能 在这个版面删除帖子
不能 在这个版面提交附件

前往 :  
本站点为公益性站点,用于推广开源自由软件,由 DiaHosting VPSBudgetVM VPS 提供服务。
我们认为:软件应可免费取得,软件工具在各种语言环境下皆可使用,且不会有任何功能上的差异;
人们应有定制和修改软件的自由,且方式不受限制,只要他们自认为合适。

Powered by phpBB © 2000, 2002, 2005, 2007 phpBB Group
简体中文语系由 王笑宇 翻译