我在编译tslib的,make之后就出现这样的错误,哪位好心人能帮帮我:

系统错误报告和讨论
回复
lengyufeixue
帖子: 12
注册时间: 2011-04-17 16:04
送出感谢: 0
接收感谢: 0

我在编译tslib的,make之后就出现这样的错误,哪位好心人能帮帮我:

#1

帖子 lengyufeixue » 2011-04-26 11:10

我在编译tslib的,make之后就出现这样的错误,哪位好心人能帮帮我:


libtool: compile: arm-linux-gcc -DHAVE_CONFIG_H -I. -I.. -DPLUGIN_DIR=\"/usr/local/tslib/lib/ts\" -DTS_CONF=\"/usr/local/tslib/etc/ts.conf\" -DTS_POINTERCAL=\"/usr/local/tslib/etc/pointercal\" -DTSLIB_INTERNAL -O2 -Wall -W -MT ts_attach.lo -MD -MP -MF .deps/ts_attach.Tpo -c ts_attach.c -fPIC -DPIC -o .libs/ts_attach.o
../libtool: line 970: arm-linux-gcc: command not found
make[2]: *** [ts_attach.lo] 错误 1
make[2]:正在离开目录 `/opt/Atmel-SAM9261/kergoth-tslib-412d99d/src'
make[1]: *** [all-recursive] 错误 1
make[1]:正在离开目录 `/opt/Atmel-SAM9261/kergoth-tslib-412d99d'
make: *** [all] 错误 2
lyhic
帖子: 112
注册时间: 2007-06-29 20:19
送出感谢: 0
接收感谢: 1 次

Re: 我在编译tslib的,make之后就出现这样的错误,哪位好心人能帮帮我:

#2

帖子 lyhic » 2011-04-27 13:39

你的错误很明显嘛,没有找到arm-linux-gcc,看下你的环境变量是否正确
回复

回到 “Ubuntu错误报告”