linux-source有问题?

为当前最终发行版之前的所有版本提供支持
回复
uframer
帖子: 8
注册时间: 2005-08-25 22:24
来自: zju, neu
送出感谢: 0
接收感谢: 0
联系:

linux-source有问题?

#1

帖子 uframer » 2006-06-24 17:11

源里的linux-source-2.6.15,使用/boot下的config-2.6.15-25-386编译出错:

In file included from drivers/usb/net/zd1211/zd1205.c:37:
drivers/usb/net/zd1211/zdinlinef.h: 在函数 ‘Cfg_CtrlSetting’ 中:
drivers/usb/net/zd1211/zdinlinef.h:307: 警告: ‘LenInUs’ may be used uninitialized in this function
drivers/usb/net/zd1211/zdinlinef.h:308: 警告: ‘NextLenInUs’ may be used uninitialized in this function
drivers/usb/net/zd1211/zd1205.c: 在函数 ‘zd1205_house_keeping’ 中:
drivers/usb/net/zd1211/zd1205.c:790: 警告: 未使用的变量 ‘tmpvalue’
drivers/usb/net/zd1211/zd1205.c: 在函数 ‘zd1205_transmit_cleanup’ 中:
drivers/usb/net/zd1211/zd1205.c:1109: 警告: 未使用的变量 ‘i’
drivers/usb/net/zd1211/zd1205.c: 在函数 ‘zd1205_tx_isr’ 中:
drivers/usb/net/zd1211/zd1205.c:1139: 警告: 未使用的变量 ‘next_sw_tcb’
drivers/usb/net/zd1211/zd1205.c: 在函数 ‘zd1205_start_ru’ 中:
drivers/usb/net/zd1211/zd1205.c:1739: 警告: 未使用的变量 ‘loopCnt’
drivers/usb/net/zd1211/zd1205.c:1733: 警告: 未使用的变量 ‘tmp_value’
drivers/usb/net/zd1211/zd1205.c: 在函数 ‘zd1205_recycle_rx’ 中:
drivers/usb/net/zd1211/zd1205.c:1770: 警告: 未使用的变量 ‘buffer_found’
drivers/usb/net/zd1211/zd1205.c:1766: 警告: 未使用的变量 ‘tmp_value’
drivers/usb/net/zd1211/zd1205.c: 在函数 ‘zd1205_sleep_reset’ 中:
drivers/usb/net/zd1211/zd1205.c:2883: 警告: 未使用的变量 ‘flags’
drivers/usb/net/zd1211/zd1205.c: 在函数 ‘zd1205_process_wakeup’ 中:
drivers/usb/net/zd1211/zd1205.c:2996: 警告: 未使用的变量 ‘tmpvalue’
drivers/usb/net/zd1211/zd1205.c:2995: 警告: 未使用的变量 ‘TSFTimer’
drivers/usb/net/zd1211/zd1205.c: 在函数 ‘zd1205_watchdog’ 中:
drivers/usb/net/zd1211/zd1205.c:3177: 警告: 未使用的变量 ‘tmpvalue’
drivers/usb/net/zd1211/zd1205.c:3174: 警告: 未使用的变量 ‘diffTime’
drivers/usb/net/zd1211/zd1205.c:3173: 警告: 未使用的变量 ‘i’
drivers/usb/net/zd1211/zd1205.c: 在函数 ‘zd1205wext_siwscan’ 中:
drivers/usb/net/zd1211/zd1205.c:4021: 警告: 未使用的变量 ‘macp’
drivers/usb/net/zd1211/zd1205.c: 在函数 ‘zd1205_translate_scan’ 中:
drivers/usb/net/zd1211/zd1205.c:4041: 警告: 未使用的变量 ‘macp’
drivers/usb/net/zd1211/zd1205.c: 在函数 ‘zd1205_load_card_setting’ 中:
drivers/usb/net/zd1211/zd1205.c:4868: 警告: 未使用的变量 ‘j’
drivers/usb/net/zd1211/zd1205.c:4861: 警告: 未使用的变量 ‘stat’
drivers/usb/net/zd1211/zd1205.c: 在函数 ‘zd1205_save_card_setting’ 中:
drivers/usb/net/zd1211/zd1205.c:5015: 警告: 未使用的变量 ‘i’
drivers/usb/net/zd1211/zd1205.c:5008: 警告: 未使用的变量 ‘stat’
drivers/usb/net/zd1211/zd1205.c: 在函数 ‘zd1205_clear_structs’ 中:
drivers/usb/net/zd1211/zd1205.c:5127: 警告: 未使用的变量 ‘macp’
drivers/usb/net/zd1211/zd1205.c: 在函数 ‘zdcb_setup_next_send’ 中:
drivers/usb/net/zd1211/zd1205.c:5161: 警告: 未使用的变量 ‘loopCnt’
drivers/usb/net/zd1211/zd1205.c:5159: 警告: 未使用的变量 ‘lock_flag’
drivers/usb/net/zd1211/zd1205.c:5150: 警告: 未使用的变量 ‘tmp_value3’
drivers/usb/net/zd1211/zd1205.c:5150: 警告: 未使用的变量 ‘tmp_value’
drivers/usb/net/zd1211/zd1205.c:5145: 警告: 未使用的变量 ‘next_sw_tcb’
drivers/usb/net/zd1211/zdinlinef.h:307: 警告: ‘LenInUs’ may be used uninitialized in this function
drivers/usb/net/zd1211/zdinlinef.h:308: 警告: ‘NextLenInUs’ may be used uninitialized in this function
drivers/usb/net/zd1211/zd1205.c: 在顶层:
drivers/usb/net/zd1211/zd1205.c:3534: 警告: ‘zd1205_ioctl_getsens’ 定义后未使用
drivers/usb/net/zd1211/zd1205.c:3834: 警告: ‘zd1205wext_giwname’ 定义后未使用
drivers/usb/net/zd1211/zd1205.c:3850: 警告: ‘zd1205wext_siwfreq’ 定义后未使用
drivers/usb/net/zd1211/zd1205.c:3891: 警告: ‘zd1205wext_siwrate’ 定义后未使用
drivers/usb/net/zd1211/zd1205.c:3913: 警告: ‘zd1205wext_siwrts’ 定义后未使用
drivers/usb/net/zd1211/zd1205.c:3923: 警告: ‘zd1205wext_siwfrag’ 定义后未使用
drivers/usb/net/zd1211/zd1205.c:3928: 警告: ‘zd1205wext_giwtxpow’ 定义后未使用
drivers/usb/net/zd1211/zd1205.c:3933: 警告: ‘zd1205wext_siwtxpow’ 定义后未使用
drivers/usb/net/zd1211/zd1205.c:3938: 警告: ‘zd1205wext_giwap’ 定义后未使用
drivers/usb/net/zd1211/zd1205.c:3949: 警告: ‘zd1205wext_siwencode’ 定义后未使用
drivers/usb/net/zd1211/zd1205.c:3954: 警告: ‘zd1205wext_giwencode’ 定义后未使用
CC [M] drivers/usb/net/zd1211/zdasocsvc.o
drivers/usb/net/zd1211/zdasocsvc.c: 在函数 ‘Re_Asociate’ 中:
drivers/usb/net/zd1211/zdasocsvc.c:268: 警告: 标号 ‘wpa_check_ok’ 定义后未使用
CC [M] drivers/usb/net/zd1211/zdauthreq.o
CC [M] drivers/usb/net/zd1211/zdauthrsp.o
CC [M] drivers/usb/net/zd1211/zdmmrx.o
CC [M] drivers/usb/net/zd1211/zdshared.o
CC [M] drivers/usb/net/zd1211/zdhci.o
drivers/usb/net/zd1211/zdhci.c: 在函数 ‘zd_ReceivePkt’ 中:
drivers/usb/net/zd1211/zdhci.c:288: 警告: 未使用的变量 ‘Type’
drivers/usb/net/zd1211/zdhci.c: 在函数 ‘zd_ResetDevice’ 中:
drivers/usb/net/zd1211/zdhci.c:886: 警告: 未使用的变量 ‘i_state’
drivers/usb/net/zd1211/zdhci.c: 在函数 ‘zd_SwitchNextCH’ 中:
drivers/usb/net/zd1211/zdhci.c:1152: 警告: 未使用的变量 ‘cap’
drivers/usb/net/zd1211/zdhci.c:1151: 警告: 未使用的变量 ‘j’
drivers/usb/net/zd1211/zdhci.c:1151: 警告: 未使用的变量 ‘i’
drivers/usb/net/zd1211/zdhci.c:1147: 警告: 未使用的变量 ‘tmp’
drivers/usb/net/zd1211/zdhci.c:1146: 警告: 未使用的变量 ‘i_state’
CC [M] drivers/usb/net/zd1211/zdglobal.o
CC [M] drivers/usb/net/zd1211/zdencrypt.o
CC [M] drivers/usb/net/zd1211/zdpmfilter.o
drivers/usb/net/zd1211/zdpmfilter.c: 在函数 ‘TxSend’ 中:
drivers/usb/net/zd1211/zdpmfilter.c:155: 警告: 未使用的变量 ‘RC4Key’
drivers/usb/net/zd1211/zdpmfilter.c:149: 警告: 未使用的变量 ‘icv’
CC [M] drivers/usb/net/zd1211/zdpsmon.o
drivers/usb/net/zd1211/zdpsmon.c: 在函数 ‘RxInfoIndicate’ 中:
drivers/usb/net/zd1211/zdpsmon.c:351: 警告: ‘asoc’ may be used uninitialized in this function
drivers/usb/net/zd1211/zdpsmon.c:350: 警告: ‘oldPsm’ may be used uninitialized in this function
drivers/usb/net/zd1211/zdpsmon.c: 在函数 ‘zd_SetKeyInfo’ 中:
drivers/usb/net/zd1211/zdpsmon.c:600: 警告: 未使用的变量 ‘KeyRsc’
CC [M] drivers/usb/net/zd1211/zdsynch.o
drivers/usb/net/zd1211/zdsynch.c: 在函数 ‘ProbeRsp_Beacon’ 中:
drivers/usb/net/zd1211/zdsynch.c:210: 警告: 未使用的变量 ‘pWPA’
CC [M] drivers/usb/net/zd1211/zdbuf.o
drivers/usb/net/zd1211/zdbuf.c: 在函数 ‘initFdescBuf’ 中:
drivers/usb/net/zd1211/zdbuf.c:129: 警告: 未使用的变量 ‘pFrmDesc’
CC [M] drivers/usb/net/zd1211/zdhw.o
drivers/usb/net/zd1211/zdhw.c: 在函数 ‘HW_Set_AL2230_RF_Chips’ 中:
drivers/usb/net/zd1211/zdhw.c:630: 警告: ‘tmpvalue’ is used uninitialized in this function
drivers/usb/net/zd1211/zdhw.c: 在函数 ‘HW_GetNow’ 中:
drivers/usb/net/zd1211/zdhw.c:1332: 警告: 未使用的变量 ‘reg’
drivers/usb/net/zd1211/zdhw.c: 在函数 ‘HW_RadioOnOff’ 中:
drivers/usb/net/zd1211/zdhw.c:1372: 警告: ‘tmpvalue’ is used uninitialized in this function
drivers/usb/net/zd1211/zdhw.c: 在函数 ‘HW_OverWritePhyRegFromE2P’ 中:
drivers/usb/net/zd1211/zdhw.c:1697: 警告: 未使用的变量 ‘PhyValue’
drivers/usb/net/zd1211/zdhw.c:1696: 警告: 未使用的变量 ‘PhyIdx’
drivers/usb/net/zd1211/zdhw.c:1695: 警告: 未使用的变量 ‘i’
drivers/usb/net/zd1211/zdhw.c:1693: 警告: 未使用的变量 ‘NumOfReg’
drivers/usb/net/zd1211/zdhw.c: 在函数 ‘HW_UpdateIntegrationValue’ 中:
drivers/usb/net/zd1211/zdhw.c:1748: 警告: 未使用的变量 ‘reg’
CC [M] drivers/usb/net/zd1211/zddebug.o
drivers/usb/net/zd1211/zddebug.c: 在函数 ‘zd1205_dump_regs’ 中:
drivers/usb/net/zd1211/zddebug.c:57: 警告: 未使用的变量 ‘flags’
CC [M] drivers/usb/net/zd1211/zdtkipseed.o
CC [M] drivers/usb/net/zd1211/zdmic.o
DEVLIST drivers/usb/net/zd1211/zddevlist.h
make[4]: *** [drivers/usb/net/zd1211/zddevlist.h] 错误 1
make[3]: *** [drivers/usb/net/zd1211] 错误 2
make[2]: *** [drivers/usb/net] 错误 2
make[1]: *** [drivers/usb] 错误 2
make: *** [drivers] 错误 2

难道源里的内核源码有问题?
Youth is wasted on the young.
uframer
帖子: 8
注册时间: 2005-08-25 22:24
来自: zju, neu
送出感谢: 0
接收感谢: 0
联系:

#2

帖子 uframer » 2006-06-24 18:39

在网上看到说是因为没装gawk,我一看,还真是,那个zddevlist.awk没人处理,faint!现在装上gawk试试 ,linux-source的依赖关系不完整啊
Youth is wasted on the young.
kpenny
帖子: 1
注册时间: 2007-07-10 9:05
送出感谢: 0
接收感谢: 0

装了 gawk 之后好像也不行,在 menuconfig 里面去掉了 zd1211 support

#3

帖子 kpenny » 2007-07-10 9:29

device drivers->USB support ->USB network adapters (its a long way down!) and then remove the 'USB ZD1211 based wireless device support' from the config.
回复

回到 “老旧版本支持”