当前时区为 UTC + 8 小时



发表新帖 回复这个主题  [ 11 篇帖子 ] 
作者 内容
1 楼 
 文章标题 : [问题]新手问题,关于那该死的Dr.com
帖子发表于 : 2007-06-11 20:44 
头像

注册: 2007-06-10 8:28
帖子: 29
送出感谢: 0 次
接收感谢: 0 次
我在win下用的是dr.com3.39上网,前几天刚装了个Ubuntu,第一次用Linux系统,按照网上的Drcom for Linux配置,可是没有成功,请问如何知道,用Dr.com登陆的服务器地址?我打开Drcom的填用户名和密码的窗体上没有服务器地址一项啊?请问还有其他的方法知道,服务器的地址吗?也就是drcom for linux的配置里面,servip这一项,该如何填了?
感谢各位前辈,请多多指点,小弟太菜了...


页首
 用户资料  
 
2 楼 
 文章标题 :
帖子发表于 : 2007-06-12 20:51 

注册: 2007-06-06 14:24
帖子: 196
送出感谢: 0 次
接收感谢: 0 次
你的dr.com for linux是在哪里下载的?


页首
 用户资料  
 
3 楼 
 文章标题 :
帖子发表于 : 2007-06-13 21:49 
头像

注册: 2007-06-10 8:28
帖子: 29
送出感谢: 0 次
接收感谢: 0 次
http://sourceforge.net/projects/drcom-client
从这里下的啊,这里的是drcom-1.3.5 这个不行之后 我试了下面的 drcom-1.3.2,还是不行
解压之后,make的时候 出现下面的提示:
root@BLACKSTAR:/home/blackstar/Drcom/drcom-1.3.2# make
make -C drcomc
make[1]: Entering directory `/home/blackstar/Drcom/drcom-1.3.2/drcomc'
make[1]: Nothing to be done for `all'.
make[1]: Leaving directory `/home/blackstar/Drcom/drcom-1.3.2/drcomc'
make -C drcomd
make[1]: Entering directory `/home/blackstar/Drcom/drcom-1.3.2/drcomd'
make[1]: Nothing to be done for `all'.
make[1]: Leaving directory `/home/blackstar/Drcom/drcom-1.3.2/drcomd'
make -C kmod
make[1]: Entering directory `/home/blackstar/Drcom/drcom-1.3.2/kmod'
make -C /lib/modules/2.6.20-15-generic/build M=/home/blackstar/Drcom/drcom-1.3.2/kmod modules
make[2]: Entering directory `/usr/src/linux-headers-2.6.20-15-generic'
Building modules, stage 2.
MODPOST 1 modules
make[2]: Leaving directory `/usr/src/linux-headers-2.6.20-15-generic'
make[1]: Leaving directory `/home/blackstar/Drcom/drcom-1.3.2/kmod'
崩溃啊,这样来回倒系统,希望楼上的 还有各位大侠多多帮忙啊~~~
还有,如何知道配置文件里面的servip ???


页首
 用户资料  
 
4 楼 
 文章标题 :
帖子发表于 : 2007-06-14 13:04 
头像

注册: 2005-12-10 17:36
帖子: 336
地址: 北京市海淀区上地十街辉煌国际
送出感谢: 0 次
接收感谢: 0 次
用抓包工具在windows下抓包分析,就可以搞到servip.


_________________
Laptop:HP Compaq Presario V3210AU
OS:Gentoo openbox+stalonetray+rox-filer+gmrun+mplayer+firefox+ibus+sonata+tilda
Phone:Orange Dopod 838+ SPV C600
OS:Windows Mobile 6.1


页首
 用户资料  
 
5 楼 
 文章标题 :
帖子发表于 : 2007-06-14 16:33 
头像

注册: 2007-06-10 8:28
帖子: 29
送出感谢: 0 次
接收感谢: 0 次
谢谢楼上的大侠 servip应该差不多了 不过 还有些问题 我make的时候老是提示:
root@BLACKSTAR:/home/blackstar/Drcom/libdrcom-0.0-20050423-2# make
gcc -Wall -Wextra -Wstrict-prototypes -Wmissing-prototypes -pedantic -Iinclude -O2 -D_REENTRANT -c -o src/init.o src/init.c
gcc -Wall -Wextra -Wstrict-prototypes -Wmissing-prototypes -pedantic -Iinclude -O2 -D_REENTRANT -c -o src/cleanup.o src/cleanup.c
gcc -Wall -Wextra -Wstrict-prototypes -Wmissing-prototypes -pedantic -Iinclude -O2 -D_REENTRANT -c -o src/handle.o src/handle.c
gcc -Wall -Wextra -Wstrict-prototypes -Wmissing-prototypes -pedantic -Iinclude -O2 -D_REENTRANT -c -o src/login.o src/login.c
src/login.c:22:25: error: openssl/md5.h: No such file or directory
src/login.c: In function ‘drcom_login’:
src/login.c:34: warning: unused parameter ‘timeout’
src/login.c: In function ‘_build_login_packet’:
src/login.c:84: warning: implicit declaration of function ‘MD5’
make: *** [src/login.o] Error 1

root@BLACKSTAR:/home/blackstar/Drcom/drcomsuite-0.1.12# make
make -C include
make[1]: Entering directory `/home/blackstar/Drcom/drcomsuite-0.1.12/include'
make[1]: Nothing to be done for `all'.
make[1]: Leaving directory `/home/blackstar/Drcom/drcomsuite-0.1.12/include'
make -C drcomc
make[1]: Entering directory `/home/blackstar/Drcom/drcomsuite-0.1.12/drcomc'
gcc -Wall -W -Wstrict-prototypes -Wmissing-prototypes -pedantic -I/home/blackstar/Drcom/drcomsuite-0.1.12 -I/home/blackstar/Drcom/drcomsuite-0.1.12/include -O2 -c -o drcomc.o drcomc.c
gcc drcomc.o -o drcomc
make[1]: Leaving directory `/home/blackstar/Drcom/drcomsuite-0.1.12/drcomc'
make -C drcomcd
make[1]: Entering directory `/home/blackstar/Drcom/drcomsuite-0.1.12/drcomcd'
gcc -Wall -W -Wstrict-prototypes -Wmissing-prototypes -pedantic -I/home/blackstar/Drcom/drcomsuite-0.1.12 -I/home/blackstar/Drcom/drcomsuite-0.1.12/include -O2 -DREENTRANT -c -o drcomcd.o drcomcd.c
gcc -Wall -W -Wstrict-prototypes -Wmissing-prototypes -pedantic -I/home/blackstar/Drcom/drcomsuite-0.1.12 -I/home/blackstar/Drcom/drcomsuite-0.1.12/include -O2 -DREENTRANT -c -o daemon.o daemon.c
daemon.c:8:19: error: drcom.h: No such file or directory
In file included from daemon.c:11:
/home/blackstar/Drcom/drcomsuite-0.1.12/include/drcom_types.h:13: error: expected specifier-qualifier-list before ‘uint8_t’
/home/blackstar/Drcom/drcomsuite-0.1.12/include/drcom_types.h:14: warning: struct has no members
/home/blackstar/Drcom/drcomsuite-0.1.12/include/drcom_types.h:18: error: expected specifier-qualifier-list before ‘uint8_t’
/home/blackstar/Drcom/drcomsuite-0.1.12/include/drcom_types.h:19: warning: struct has no members
/home/blackstar/Drcom/drcomsuite-0.1.12/include/drcom_types.h:23: error: expected specifier-qualifier-list before ‘uint32_t’
/home/blackstar/Drcom/drcomsuite-0.1.12/include/drcom_types.h:29: warning: struct has no members
/home/blackstar/Drcom/drcomsuite-0.1.12/include/drcom_types.h:33: error: expected specifier-qualifier-list before ‘uint32_t’
/home/blackstar/Drcom/drcomsuite-0.1.12/include/drcom_types.h:35: warning: struct has no members
daemon.c:20: warning: ‘struct drcom_handle’ declared inside parameter list
daemon.c:20: warning: its scope is only this definition or declaration, which is probably not what you want
daemon.c: In function ‘drcomcd_daemon’:
daemon.c:55: warning: implicit declaration of function ‘drcom_create_handle’
daemon.c:55: warning: assignment makes pointer from integer without a cast
daemon.c:56: warning: implicit declaration of function ‘drcom_init’
daemon.c:114: warning: implicit declaration of function ‘drcom_login’
daemon.c:129: warning: passing argument 1 of ‘module_start_auth’ from incompatible pointer type
daemon.c:149: warning: implicit declaration of function ‘drcom_logout’
daemon.c:157: warning: passing argument 1 of ‘module_start_auth’ from incompatible pointer type
daemon.c:178: warning: implicit declaration of function ‘drcom_passwd’
daemon.c: In function ‘daemon_watchport’:
daemon.c:256: warning: implicit declaration of function ‘drcom_watchport’
daemon.c: In function ‘daemon_keepalive’:
daemon.c:264: warning: implicit declaration of function ‘drcom_keepalive’
daemon.c: At top level:
daemon.c:269: warning: ‘struct drcom_handle’ declared inside parameter list
daemon.c:270: error: conflicting types for ‘module_start_auth’
daemon.c:20: error: previous declaration of ‘module_start_auth’ was here
daemon.c: In function ‘module_start_auth’:
daemon.c:279: warning: implicit declaration of function ‘drcom_get_session_info’
daemon.c:279: warning: assignment makes pointer from integer without a cast
daemon.c:280: warning: implicit declaration of function ‘drcom_get_authlen’
daemon.c:283: error: ‘struct drcom_auth_data’ has no member named ‘auth’
daemon.c:283: error: dereferencing pointer to incomplete type
daemon.c:287: error: ‘struct drcom_iface_data’ has no member named ‘hostip’
daemon.c:287: error: dereferencing pointer to incomplete type
daemon.c:288: error: ‘struct drcom_iface_data’ has no member named ‘hostport’
daemon.c:288: error: dereferencing pointer to incomplete type
daemon.c:289: error: ‘struct drcom_iface_data’ has no member named ‘servip’
daemon.c:289: error: dereferencing pointer to incomplete type
daemon.c:290: error: ‘struct drcom_iface_data’ has no member named ‘servport’
daemon.c:290: error: dereferencing pointer to incomplete type
daemon.c:291: error: ‘struct drcom_iface_data’ has no member named ‘dnsp’
daemon.c:291: error: dereferencing pointer to incomplete type
daemon.c:292: error: ‘struct drcom_iface_data’ has no member named ‘dnss’
daemon.c:292: error: dereferencing pointer to incomplete type
daemon.c:296: error: ‘struct drcom_except_data’ has no member named ‘addr’
daemon.c:297: error: ‘struct drcom_except_data’ has no member named ‘mask’
daemon.c:345: error: ‘struct drcom_status_data’ has no member named ‘status’
daemon.c: In function ‘module_stop_auth’:
daemon.c:370: error: ‘struct drcom_status_data’ has no member named ‘status’
make[1]: *** [daemon.o] Error 1
make[1]: Leaving directory `/home/blackstar/Drcom/drcomsuite-0.1.12/drcomcd'
make: *** [drcomcd] Error 2


root@BLACKSTAR:/home/blackstar/Drcom/drcom-1.3.5# make
make -C drcomc
make[1]: Entering directory `/home/blackstar/Drcom/drcom-1.3.5/drcomc'
make[1]: Nothing to be done for `all'.
make[1]: Leaving directory `/home/blackstar/Drcom/drcom-1.3.5/drcomc'
make -C drcomd
make[1]: Entering directory `/home/blackstar/Drcom/drcom-1.3.5/drcomd'
make[1]: Nothing to be done for `all'.
make[1]: Leaving directory `/home/blackstar/Drcom/drcom-1.3.5/drcomd'
make -C kmod
make[1]: Entering directory `/home/blackstar/Drcom/drcom-1.3.5/kmod'
make -C /lib/modules/2.6.20-15-generic/build M=/home/blackstar/Drcom/drcom-1.3.5/kmod modules
make[2]: Entering directory `/usr/src/linux-headers-2.6.20-15-generic'
Building modules, stage 2.
MODPOST 1 modules
make[2]: Leaving directory `/usr/src/linux-headers-2.6.20-15-generic'
make[1]: Leaving directory `/home/blackstar/Drcom/drcom-1.3.5/kmod'


页首
 用户资料  
 
6 楼 
 文章标题 :
帖子发表于 : 2007-06-14 16:37 
头像

注册: 2007-06-10 8:28
帖子: 29
送出感谢: 0 次
接收感谢: 0 次
我下了个 libssl-dev_0.9.8e-5_i386.deb
libssl-dev 如何安装啊······


页首
 用户资料  
 
7 楼 
 文章标题 :
帖子发表于 : 2007-06-14 16:46 
头像

注册: 2006-11-22 9:41
帖子: 28
地址: Shenzhen
送出感谢: 0 次
接收感谢: 0 次
1. 我总觉得你make我之前好像没有configure,因此找不到多头文件。

2. 关于libssl-dev.
我的就直接有,版本是0.9.8c-4build1,这有什么问题呢?
# sudo apt-get install libssl-dev

依赖和冲突情况是:
Depends: libssl0.9.8 (= 0.9.8c-4build1), zlib1g-dev
Conflicts: ssleay (<< 0.9.2b), libssl08-dev, libssl09-dev, libssl095a-dev, libssl096-dev


_________________
Linux is a user-friendly os, but she's picky for her friends.


页首
 用户资料  
 
8 楼 
 文章标题 :
帖子发表于 : 2007-06-14 20:22 
头像

注册: 2005-12-10 17:36
帖子: 336
地址: 北京市海淀区上地十街辉煌国际
送出感谢: 0 次
接收感谢: 0 次
当然。现在我的也还没搞好。不过比你的好点。你有些必要的工作没有做。看下论坛。


_________________
Laptop:HP Compaq Presario V3210AU
OS:Gentoo openbox+stalonetray+rox-filer+gmrun+mplayer+firefox+ibus+sonata+tilda
Phone:Orange Dopod 838+ SPV C600
OS:Windows Mobile 6.1


页首
 用户资料  
 
9 楼 
 文章标题 :
帖子发表于 : 2007-06-18 9:20 
头像

注册: 2007-06-10 8:28
帖子: 29
送出感谢: 0 次
接收感谢: 0 次
楼上的是指哪些必要的工作了?我就是按照论坛上的帖子一步一步做的,可是老是出现问题,还有那个lissbl-dev如何安装了,我在网上下了个一个dev包,但是我放在/var/cache/apt/archives,之后包上出现了一个带叉的符号,apt-get install libssl-dev还是无法找到包。希望各位再指点指点小弟~~~


页首
 用户资料  
 
10 楼 
 文章标题 :
帖子发表于 : 2007-08-17 21:32 
头像

注册: 2007-07-17 22:52
帖子: 661
地址: cn,shandong
送出感谢: 0 次
接收感谢: 0 次
deb包需要用sudo dpkg -i 包名称来安装!!


页首
 用户资料  
 
11 楼 
 文章标题 :
帖子发表于 : 2007-08-17 21:58 
头像

注册: 2006-01-25 22:29
帖子: 1322
地址: 上海
送出感谢: 0 次
接收感谢: 0 次
deb的包治需要双击就可以安装。
前面的源码安装的话,
先是
sudo ./configure
sudo make
sudo make install
如果出问题,请把./configure后面的内容贴出来。


页首
 用户资料  
 
显示帖子 :  排序  
发表新帖 回复这个主题  [ 11 篇帖子 ] 

当前时区为 UTC + 8 小时


在线用户

正在浏览此版面的用户:Yahoo [Bot] 和 4 位游客


不能 在这个版面发表主题
不能 在这个版面回复主题
不能 在这个版面编辑帖子
不能 在这个版面删除帖子
不能 在这个版面提交附件

前往 :  
本站点为公益性站点,用于推广开源自由软件,由 DiaHosting VPSBudgetVM VPS 提供服务。
我们认为:软件应可免费取得,软件工具在各种语言环境下皆可使用,且不会有任何功能上的差异;
人们应有定制和修改软件的自由,且方式不受限制,只要他们自认为合适。

Powered by phpBB © 2000, 2002, 2005, 2007 phpBB Group
简体中文语系由 王笑宇 翻译