当前时区为 UTC + 8 小时



发表新帖 回复这个主题  [ 6 篇帖子 ] 
作者 内容
1 楼 
 文章标题 : [问题]make 编译出错
帖子发表于 : 2007-08-09 13:02 

注册: 2007-08-09 12:57
帖子: 6
地址: 浙江
送出感谢: 0 次
接收感谢: 0 次
执行 make 后出现如下错误
cc -s -Wall -ggdb -c -o 915resolution.o 915resolution.c
915resolution.c:18:19: 错误: stdio.h:No such file or directory
915resolution.c:19:20: 错误: stdlib.h:No such file or directory
915resolution.c:20:20: 错误: unistd.h:No such file or directory
915resolution.c:22:20: 错误: string.h:No such file or directory
915resolution.c:23:22: 错误: sys/mman.h:No such file or directory
915resolution.c:24:19: 错误: fcntl.h:No such file or directory
915resolution.c:25:20: 错误: sys/io.h:No such file or directory
915resolution.c:27:20: 错误: assert.h:No such file or directory
915resolution.c: 在函数 ‘initialize_system’ 中:
915resolution.c:168: 警告: 隐式声明函数 ‘iopl’
915resolution.c:169: 警告: 隐式声明函数 ‘perror’
915resolution.c:170: 警告: 隐式声明函数 ‘exit’
915resolution.c:170: 警告: 隐式声明与内建函数 ‘exit’ 不兼容
915resolution.c: 在函数 ‘get_chipset_id’ 中:
915resolution.c:176: 警告: 隐式声明函数 ‘outl’
915resolution.c:177: 警告: 隐式声明函数 ‘inl’
915resolution.c: 在函数 ‘open_vbios’ 中:
915resolution.c:284: 警告: 隐式声明函数 ‘calloc’
915resolution.c:284: 警告: 隐式声明与内建函数 ‘calloc’ 不兼容
915resolution.c:307: 警告: 隐式声明函数 ‘open’
915resolution.c:307: 错误: ‘O_RDWR’ 未声明 (在此函数内第一次使用)
915resolution.c:307: 错误: (即使在一个函数内多次出现,每个未声明的标识符在其
915resolution.c:307: 错误: 所在的函数内只报告一次。)
915resolution.c:310: 警告: 隐式声明函数 ‘fprintf’
915resolution.c:310: 警告: 隐式声明与内建函数 ‘fprintf’ 不兼容
915resolution.c:310: 错误: ‘stderr’ 未声明 (在此函数内第一次使用)
915resolution.c:313: 警告: 隐式声明与内建函数 ‘exit’ 不兼容
915resolution.c:316: 警告: 隐式声明函数 ‘mmap’
915resolution.c:317: 错误: ‘PROT_READ’ 未声明 (在此函数内第一次使用)
915resolution.c:317: 错误: ‘PROT_WRITE’ 未声明 (在此函数内第一次使用)
915resolution.c:317: 错误: ‘MAP_SHARED’ 未声明 (在此函数内第一次使用)
915resolution.c:318: 警告: 赋值时将整数赋给指针,未作类型转换
915resolution.c:320: 错误: ‘MAP_FAILED’ 未声明 (在此函数内第一次使用)
915resolution.c:322: 警告: 隐式声明与内建函数 ‘fprintf’ 不兼容
915resolution.c:325: 警告: 隐式声明函数 ‘close’
915resolution.c:326: 警告: 隐式声明与内建函数 ‘exit’ 不兼容
915resolution.c:333: 警告: 隐式声明与内建函数 ‘fprintf’ 不兼容
915resolution.c:336: 警告: 隐式声明与内建函数 ‘exit’ 不兼容
915resolution.c:341: 警告: 赋值时将整数赋给指针,未作类型转换
915resolution.c:345: 警告: 隐式声明与内建函数 ‘fprintf’ 不兼容
915resolution.c:349: 警告: 隐式声明与内建函数 ‘exit’ 不兼容
915resolution.c:357: 警告: 隐式声明函数 ‘memmem’
915resolution.c:357: 警告: 隐式声明函数 ‘strlen’
915resolution.c:357: 警告: 隐式声明与内建函数 ‘strlen’ 不兼容
915resolution.c:359: 警告: 隐式声明与内建函数 ‘fprintf’ 不兼容
915resolution.c:361: 警告: 隐式声明与内建函数 ‘exit’ 不兼容
915resolution.c:369: 警告: 隐式声明与内建函数 ‘fprintf’ 不兼容
915resolution.c:371: 警告: 隐式声明与内建函数 ‘exit’ 不兼容
915resolution.c:379: 警告: 隐式声明与内建函数 ‘fprintf’ 不兼容
915resolution.c:386: 警告: 隐式声明与内建函数 ‘exit’ 不兼容
915resolution.c:394: 警告: 隐式声明与内建函数 ‘fprintf’ 不兼容
915resolution.c:399: 警告: 隐式声明与内建函数 ‘exit’ 不兼容
915resolution.c:423: 警告: 隐式声明与内建函数 ‘fprintf’ 不兼容
915resolution.c:429: 警告: 隐式声明与内建函数 ‘exit’ 不兼容
915resolution.c:461: 警告: 隐式声明与内建函数 ‘fprintf’ 不兼容
915resolution.c:468: 警告: 隐式声明与内建函数 ‘exit’ 不兼容
915resolution.c: 在函数 ‘close_vbios’ 中:
915resolution.c:475: 警告: 隐式声明函数 ‘assert’
915resolution.c:477: 错误: ‘MAP_FAILED’ 未声明 (在此函数内第一次使用)
915resolution.c:478: 警告: 隐式声明与内建函数 ‘fprintf’ 不兼容
915resolution.c:478: 错误: ‘stderr’ 未声明 (在此函数内第一次使用)
915resolution.c:479: 警告: 隐式声明与内建函数 ‘exit’ 不兼容
915resolution.c:482: 警告: 隐式声明函数 ‘munmap’
915resolution.c:485: 警告: 隐式声明函数 ‘free’
915resolution.c: 在函数 ‘unlock_vbios’ 中:
915resolution.c:500: 警告: 隐式声明函数 ‘inb’
915resolution.c:503: 警告: 隐式声明函数 ‘outb’
915resolution.c: 在函数 ‘list_modes’ 中:
915resolution.c:582: 警告: 隐式声明函数 ‘printf’
915resolution.c:582: 警告: 隐式声明与内建函数 ‘printf’ 不兼容
915resolution.c:587: 警告: 隐式声明与内建函数 ‘printf’ 不兼容
915resolution.c:600: 警告: 隐式声明与内建函数 ‘printf’ 不兼容
915resolution.c:612: 警告: 隐式声明与内建函数 ‘printf’ 不兼容
915resolution.c: 在函数 ‘display_map_info’ 中:
915resolution.c:745: 警告: 隐式声明与内建函数 ‘printf’ 不兼容
915resolution.c: 在函数 ‘parse_args’ 中:
915resolution.c:760: 错误: ‘NULL’ 未声明 (在此函数内第一次使用)
915resolution.c:762: 警告: 隐式声明函数 ‘strcmp’
915resolution.c:848: 警告: 隐式声明函数 ‘strtol’
915resolution.c:849: 警告: 隐式声明函数 ‘atoi’
915resolution.c: 在函数 ‘usage’ 中:
915resolution.c:878: 警告: 隐式声明与内建函数 ‘printf’ 不兼容
915resolution.c: 在函数 ‘main’ 中:
915resolution.c:894: 警告: 隐式声明与内建函数 ‘printf’ 不兼容
make: *** [915resolution.o] 错误 1


我第一次使用linux 请大家帮忙解释一下这些是什么意思,该怎么解决。谢谢!


页首
 用户资料  
 
2 楼 
 文章标题 :
帖子发表于 : 2007-08-09 13:35 
头像

注册: 2006-02-27 20:19
帖子: 599
地址: works system
送出感谢: 0 次
接收感谢: 0 次
到/usr/include下看看那些头文件存在吗?
你是不是没有sudo apt-get install build-essential阿?


_________________
东西路,南北走
十字路口人咬狗
拿起狗来打砖头
砖头咬了狗一口
图片


页首
 用户资料  
 
3 楼 
 文章标题 :
帖子发表于 : 2007-08-09 13:41 
头像

注册: 2006-07-02 11:16
帖子: 12522
地址: 廣州
送出感谢: 0 次
接收感谢: 8
源里面不是有吗?


_________________
^_^ ~~~
要理解递归,首先要理解递归。

地球人都知道,理论上,理论跟实际是没有差别的,但实际上,理论跟实际的差别是相当大滴。


页首
 用户资料  
 
4 楼 
 文章标题 :
帖子发表于 : 2007-08-09 16:11 

注册: 2007-08-09 12:57
帖子: 6
地址: 浙江
送出感谢: 0 次
接收感谢: 0 次
include 里面都是文件夹,没有那个头文件
sudo apt-get install build-essential 这个是什么东东??我没有有装过,这个系统是新装的。


页首
 用户资料  
 
5 楼 
 文章标题 :
帖子发表于 : 2007-08-09 16:21 

注册: 2007-08-09 12:57
帖子: 6
地址: 浙江
送出感谢: 0 次
接收感谢: 0 次
执行了sudo apt-get install build-essential出现下面的错误
E: 无法获得锁 /var/lib/dpkg/lock - open (11 Resource temporarily unavailable)
E: Unable to lock the administration directory (/var/lib/dpkg/), is another process using it?

这些又是什么意思?
是不是没有build-essential 这个软件?


页首
 用户资料  
 
6 楼 
 文章标题 :
帖子发表于 : 2007-08-09 22:45 

注册: 2007-08-09 12:57
帖子: 6
地址: 浙江
送出感谢: 0 次
接收感谢: 0 次
终于安装好这个宽屏驱动了!!
谢谢楼上各位对我的帮助!
:D


页首
 用户资料  
 
显示帖子 :  排序  
发表新帖 回复这个主题  [ 6 篇帖子 ] 

当前时区为 UTC + 8 小时


在线用户

正在浏览此版面的用户:Google [Bot] 和 4 位游客


不能 在这个版面发表主题
不能 在这个版面回复主题
不能 在这个版面编辑帖子
不能 在这个版面删除帖子
不能 在这个版面提交附件

前往 :  
本站点为公益性站点,用于推广开源自由软件,由 DiaHosting VPSBudgetVM VPS 提供服务。
我们认为:软件应可免费取得,软件工具在各种语言环境下皆可使用,且不会有任何功能上的差异;
人们应有定制和修改软件的自由,且方式不受限制,只要他们自认为合适。

Powered by phpBB © 2000, 2002, 2005, 2007 phpBB Group
简体中文语系由 王笑宇 翻译