当前时区为 UTC + 8 小时



发表新帖 回复这个主题  [ 3 篇帖子 ] 
作者 内容
1 楼 
 文章标题 : 在kdevelop中如何添加调试时的链接库?
帖子发表于 : 2009-03-27 15:37 

注册: 2009-02-17 17:19
帖子: 13
送出感谢: 0 次
接收感谢: 0 次
刚开始用这个,照着教程弄一个最简单的UI编译都出错,我觉得是编译时没把相关的链接库编译进去,错误如下:
compiling namecard.cpp (g++)
/home/liu/Documents/namecard/src/namecard.cpp:41: error: stray '\302' in program
/home/liu/Documents/namecard/src/namecard.cpp:41: error: stray '\255' in program
/home/liu/Documents/namecard/src/namecard.cpp:42: error: stray '\302' in program
/home/liu/Documents/namecard/src/namecard.cpp:42: error: stray '\255' in program
/home/liu/Documents/namecard/src/namecard.cpp:42: error: stray '\302' in program
/home/liu/Documents/namecard/src/namecard.cpp:42: error: stray '\255' in program
/home/liu/Documents/namecard/src/namecard.cpp:43: error: stray '\302' in program
/home/liu/Documents/namecard/src/namecard.cpp:43: error: stray '\255' in program
/home/liu/Documents/namecard/src/namecard.cpp:43: error: stray '\302' in program
/home/liu/Documents/namecard/src/namecard.cpp:43: error: stray '\255' in program
/home/liu/Documents/namecard/src/namecard.cpp:44: error: stray '\302' in program
/home/liu/Documents/namecard/src/namecard.cpp:44: error: stray '\255' in program
/home/liu/Documents/namecard/src/namecard.cpp:44: error: stray '\302' in program
/home/liu/Documents/namecard/src/namecard.cpp:44: error: stray '\255' in program
/home/liu/Documents/namecard/src/namecard.cpp: In member function 'virtual void namecard::namecardslot()':
/home/liu/Documents/namecard/src/namecard.cpp:41: error: 'append' was not declared in this scope
/home/liu/Documents/namecard/src/namecard.cpp:42: error: 'text' was not declared in this scope
/home/liu/Documents/namecard/src/namecard.cpp:44: error: 'currentText' was not declared in this scope
make: *** [namecard.o] Error 1
make: Target `namecard' not remade because of errors.
*** Exited with status: 2 ***

感觉是append,text,currentText这些函数找不到
虽然前面已经加了:
#include <qlineedit.h>
#include <qcombobox.h>
#include <qmultilineedit.h>
#include <qlabel.h>
#include <qframe.h>

高手说下在kdevekop下怎么添加编译链接库
另外:我不知道这些函数是属于那个库的应该怎么找呀? :em11


页首
 用户资料  
 
2 楼 
 文章标题 : Re: 在kdevelop中如何添加调试时的链接库?
帖子发表于 : 2009-04-08 16:10 

注册: 2009-03-15 19:51
帖子: 8
送出感谢: 0 次
接收感谢: 0 次
我也想知道。 :em01


页首
 用户资料  
 
3 楼 
 文章标题 : Re: 在kdevelop中如何添加调试时的链接库?
帖子发表于 : 2010-04-27 21:42 

注册: 2010-04-19 20:20
帖子: 8
送出感谢: 0 次
接收感谢: 0 次
别的不知道。但“error: stray '\302' in program“是因为你是直接复制的,完全手写一次试试,同样遇到过这类错误,高人说手写一遍就行了,我试试还真可以,你也不防试试看


页首
 用户资料  
 
显示帖子 :  排序  
发表新帖 回复这个主题  [ 3 篇帖子 ] 

当前时区为 UTC + 8 小时


在线用户

正在浏览此版面的用户:没有注册用户 和 1 位游客


不能 在这个版面发表主题
不能 在这个版面回复主题
不能 在这个版面编辑帖子
不能 在这个版面删除帖子
不能 在这个版面提交附件

前往 :  
本站点为公益性站点,用于推广开源自由软件,由 DiaHosting VPSBudgetVM VPS 提供服务。
我们认为:软件应可免费取得,软件工具在各种语言环境下皆可使用,且不会有任何功能上的差异;
人们应有定制和修改软件的自由,且方式不受限制,只要他们自认为合适。

Powered by phpBB © 2000, 2002, 2005, 2007 phpBB Group
简体中文语系由 王笑宇 翻译