当前时区为 UTC + 8 小时



发表新帖 回复这个主题  [ 3 篇帖子 ] 
作者 内容
1 楼 
 文章标题 : [问题]CF插件都安装不上
帖子发表于 : 2008-05-02 18:05 

注册: 2006-09-20 11:20
帖子: 58
送出感谢: 0 次
接收感谢: 0 次
已经安装的dev了,这个怎么办
代码:
convert   : screensaver.xml.in -> build/screensaver.xml
bcop'ing  : build/screensaver.xml -> build/screensaver_options.h
bcop'ing  : build/screensaver.xml -> build/screensaver_options.c
schema    : build/screensaver.xml -> build/compiz-screensaver.schema
compiling : vector.cpp -> build/vector.loIn file included from vector.cpp:1:
vector.h: In member function ‘Vector Vector::toScreenSpace(CompScreen*) const’:
vector.h:37: 错误: invalid use of incomplete type ‘struct _CompScreen’
/usr/include/compiz/compiz.h:47: 错误: forward declaration of ‘struct _CompScreen’
vector.h:38: 错误: invalid use of incomplete type ‘struct _CompScreen’
/usr/include/compiz/compiz.h:47: 错误: forward declaration of ‘struct _CompScreen’
vector.h: In member function ‘Vector Vector::toCoordsSpace(CompScreen*) const’:
vector.h:46: 错误: invalid use of incomplete type ‘struct _CompScreen’
/usr/include/compiz/compiz.h:47: 错误: forward declaration of ‘struct _CompScreen’
vector.h:47: 错误: invalid use of incomplete type ‘struct _CompScreen’
/usr/include/compiz/compiz.h:47: 错误: forward declaration of ‘struct _CompScreen’
make: *** [build/vector.lo] 错误 1

代码:
bcop'ing  : build/atlantis.xml -> build/atlantis_options.h
bcop'ing  : build/atlantis.xml -> build/atlantis_options.c
schema    : build/atlantis.xml -> build/compiz-atlantis.schema
compiling : atlantis.c -> build/atlantis.loIn file included from atlantis.c:108:
atlantis-internal.h:93:25: error: compiz-core.h: No such file or directory
atlantis-internal.h:94:25: error: compiz-cube.h: No such file or directory
In file included from atlantis.c:108:
atlantis-internal.h:118: error: expected specifier-qualifier-list before 'DonePaintScreenProc'
In file included from atlantis.c:109:
build/atlantis_options.h:23: error: expected '=', ',', ';', 'asm' or '__attribute__' before '*' token
build/atlantis_options.h:30: error: expected ')' before '*' token
build/atlantis_options.h:32: error: expected '=', ',', ';', 'asm' or '__attribute__' before '*' token
build/atlantis_options.h:52: error: expected ')' before '*' token
build/atlantis_options.h:54: error: expected '=', ',', ';', 'asm' or '__attribute__' before '*' token
build/atlantis_options.h:56: error: expected ')' before '*' token
build/atlantis_options.h:57: error: expected '=', ',', ';', 'asm' or '__attribute__' before '*' token
build/atlantis_options.h:58: error: expected ')' before '*' token
build/atlantis_options.h:60: error: expected ')' before '*' token
build/atlantis_options.h:61: error: expected '=', ',', ';', 'asm' or '__attribute__' before '*' token
build/atlantis_options.h:62: error: expected ')' before '*' token
build/atlantis_options.h:64: error: expected ')' before '*' token
build/atlantis_options.h:65: error: expected '=', ',', ';', 'asm' or '__attribute__' before '*' token
build/atlantis_options.h:66: error: expected ')' before '*' token
build/atlantis_options.h:68: error: expected ')' before '*' token
build/atlantis_options.h:69: error: expected '=', ',', ';', 'asm' or '__attribute__' before '*' token
build/atlantis_options.h:70: error: expected ')' before '*' token
build/atlantis_options.h:72: error: expected ')' before '*' token
build/atlantis_options.h:73: error: expected '=', ',', ';', 'asm' or '__attribute__' before '*' token
build/atlantis_options.h:74: error: expected ')' before '*' token
build/atlantis_options.h:76: error: expected '=', ',', ';', 'asm' or '__attribute__' before 'atlantisGetColors'
build/atlantis_options.h:77: error: expected '=', ',', ';', 'asm' or '__attribute__' before '*' token
build/atlantis_options.h:78: error: expected ')' before '*' token
build/atlantis_options.h:80: error: expected ')' before '*' token
build/atlantis_options.h:81: error: expected '=', ',', ';', 'asm' or '__attribute__' before '*' token
build/atlantis_options.h:82: error: expected ')' before '*' token
build/atlantis_options.h:84: error: expected ')' before '*' token
build/atlantis_options.h:85: error: expected '=', ',', ';', 'asm' or '__attribute__' before '*' token
build/atlantis_options.h:86: error: expected ')' before '*' token
build/atlantis_options.h:88: error: expected ')' before '*' token
build/atlantis_options.h:89: error: expected '=', ',', ';', 'asm' or '__attribute__' before '*' token
build/atlantis_options.h:90: error: expected ')' before '*' token
build/atlantis_options.h:92: error: expected ')' before '*' token
build/atlantis_options.h:93: error: expected '=', ',', ';', 'asm' or '__attribute__' before '*' token
build/atlantis_options.h:94: error: expected ')' before '*' token
build/atlantis_options.h:96: error: expected ')' before '*' token
build/atlantis_options.h:97: error: expected '=', ',', ';', 'asm' or '__attribute__' before '*' token
build/atlantis_options.h:98: error: expected ')' before '*' token
build/atlantis_options.h:100: error: expected ')' before '*' token
build/atlantis_options.h:101: error: expected '=', ',', ';', 'asm' or '__attribute__' before '*' token
build/atlantis_options.h:102: error: expected ')' before '*' token
build/atlantis_options.h:104: error: expected ')' before '*' token
build/atlantis_options.h:105: error: expected '=', ',', ';', 'asm' or '__attribute__' before '*' token

build/atlantis_options.h:106: error: expected ')' before '*' token
atlantis.c:136: error: expected ')' before '*' token
atlantis.c:250: error: expected ')' before '*' token
atlantis.c:261: error: expected ')' before '*' token
atlantis.c:268: error: expected ')' before '*' token
atlantis.c:276: error: expected ')' before '*' token
atlantis.c:290: error: expected ')' before '*' token
atlantis.c:422: error: expected ')' before '*' token
atlantis.c:441: error: expected ')' before '*' token
atlantis.c:458: error: expected '=', ',', ';', 'asm' or '__attribute__' before 'atlantisInitDisplay'
atlantis.c:489: error: expected ')' before '*' token
atlantis.c:499: error: expected '=', ',', ';', 'asm' or '__attribute__' before 'atlantisInitScreen'
atlantis.c:541: error: expected ')' before '*' token
atlantis.c:558: error: expected '=', ',', ';', 'asm' or '__attribute__' before 'atlantisInit'
atlantis.c:569: error: expected ')' before '*' token
atlantis.c:576: error: expected '=', ',', ';', 'asm' or '__attribute__' before 'atlantisInitObject'
atlantis.c:589: error: expected ')' before '*' token
atlantis.c:601: error: expected '=', ',', ';', 'asm' or '__attribute__' before 'atlantisVTable'
atlantis.c:613: error: expected '=', ',', ';', 'asm' or '__attribute__' before '*' token
make: *** [build/atlantis.lo] 错误 1


页首
 用户资料  
 
2 楼 
 文章标题 :
帖子发表于 : 2008-05-02 19:28 
头像

注册: 2007-10-21 18:36
帖子: 3235
地址: 汕头/广东/中国
送出感谢: 2
接收感谢: 3
那个是老版本的插件,似乎在新版中无法使用。放弃吧。


_________________
老子的哲学是“”,庄子的哲学是“
人有一技在身,则逍遥游而无不为


页首
 用户资料  
 
3 楼 
 文章标题 :
帖子发表于 : 2008-05-02 22:34 
头像

注册: 2007-08-11 20:54
帖子: 777
地址: 广州
送出感谢: 0 次
接收感谢: 0 次
装了BCOP没有啊,那个是必备的东东哦


_________________
人的生命是有限的,但是享受Linux的乐趣是无限的!
http://www.liangsuilong.info


页首
 用户资料  
 
显示帖子 :  排序  
发表新帖 回复这个主题  [ 3 篇帖子 ] 

当前时区为 UTC + 8 小时


在线用户

正在浏览此版面的用户:没有注册用户 和 3 位游客


不能 在这个版面发表主题
不能 在这个版面回复主题
不能 在这个版面编辑帖子
不能 在这个版面删除帖子
不能 在这个版面提交附件

前往 :  
本站点为公益性站点,用于推广开源自由软件,由 DiaHosting VPSBudgetVM VPS 提供服务。
我们认为:软件应可免费取得,软件工具在各种语言环境下皆可使用,且不会有任何功能上的差异;
人们应有定制和修改软件的自由,且方式不受限制,只要他们自认为合适。

Powered by phpBB © 2000, 2002, 2005, 2007 phpBB Group
简体中文语系由 王笑宇 翻译