求助~~~make编译安装时碰到这些错误

GnomeShell/Unity/Beryl/AiGLX/XGL/Compiz Fusion
回复
ruichousky
帖子: 47
注册时间: 2007-12-26 11:26
送出感谢: 0
接收感谢: 0

求助~~~make编译安装时碰到这些错误

#1

帖子 ruichousky » 2008-11-08 8:41

administrator@administrator-desktop:~$ cd atlantis2
administrator@administrator-desktop:~/atlantis2$ make
compiling : fish.c -> build/fish.lo/bin/sh: libtool: not found
make: *** [build/fish.lo] 错误 127
清高手们帮忙解决一下 小弟在此谢过!!!
xiaobai0708
帖子: 5
注册时间: 2007-12-14 16:53
送出感谢: 0
接收感谢: 0

Re: 求助~~~make编译安装时碰到这些错误

#2

帖子 xiaobai0708 » 2008-11-08 15:20

我也是!!!
一直不能安装养鱼的插件,求助!
提示:
baibin@baibin-laptop:~/桌面/atlantis2$ make
compiling : swim.c -> build/swim.loIn file included from swim.c:94:
atlantis-internal.h:89:18: error: cube.h: 没有该文件或目录
In file included from swim.c:94:
atlantis-internal.h:113: 错误: expected specifier-qualifier-list before ‘DonePaintScreenProc’
swim.c: 在函数‘FishTransform’中:
swim.c:100: 警告: 隐式声明函数‘glTranslatef’
swim.c:100: 警告: 对‘glTranslatef’的嵌套的外部声明
swim.c:101: 警告: 隐式声明函数‘glRotatef’
swim.c:101: 警告: 对‘glRotatef’的嵌套的外部声明
swim.c: 在函数‘FishMiss’中:
swim.c:248: 错误: ‘AtlantisScreen’没有名为‘numFish’的成员
swim.c:252: 错误: ‘AtlantisScreen’没有名为‘fish’的成员
swim.c:252: 错误: ‘AtlantisScreen’没有名为‘fish’的成员
swim.c:253: 错误: ‘AtlantisScreen’没有名为‘fish’的成员
swim.c:253: 错误: ‘AtlantisScreen’没有名为‘fish’的成员
swim.c:254: 错误: ‘AtlantisScreen’没有名为‘fish’的成员
swim.c:254: 错误: ‘AtlantisScreen’没有名为‘fish’的成员
swim.c:259: 错误: ‘AtlantisScreen’没有名为‘fish’的成员
swim.c:261: 错误: ‘AtlantisScreen’没有名为‘fish’的成员
swim.c:265: 错误: ‘AtlantisScreen’没有名为‘fish’的成员
swim.c:269: 错误: ‘AtlantisScreen’没有名为‘fish’的成员
swim.c:273: 错误: ‘AtlantisScreen’没有名为‘fish’的成员
swim.c:273: 错误: ‘AtlantisScreen’没有名为‘fish’的成员
make: *** [build/swim.lo] 错误 1
回复

回到 “桌面特效”