[已解决] 编译QT库时遇到ERROR,请高手赐教。

内核编译和嵌入式产品的设计与开发
回复
头像
norx
帖子: 47
注册时间: 2008-10-30 3:20
送出感谢: 0
接收感谢: 0

[已解决] 编译QT库时遇到ERROR,请高手赐教。

#1

帖子 norx » 2009-01-18 14:39

在Ubuntu上搭建QT/X11开发环境过程中,进行到make编译QT库这一步时,出现:

代码: 全选

In file included from ../../include/QtGui/private/qt_x11_p.h:1,
                 from kernel/qapplication.cpp:70:
../../include/QtGui/private/../../../src/gui/kernel/qt_x11_p.h:65:22: error: X11/Xlib.h: No such file or directory
../../include/QtGui/private/../../../src/gui/kernel/qt_x11_p.h:70:23: error: X11/Xutil.h: No such file or directory
../../include/QtGui/private/../../../src/gui/kernel/qt_x11_p.h:71:21: error: X11/Xos.h: No such file or directory
../../include/QtGui/private/../../../src/gui/kernel/qt_x11_p.h:78:23: error: X11/Xatom.h: No such file or directory
In file included from ../../include/QtGui/private/qt_x11_p.h:1,
                 from kernel/qapplication.cpp:70:
../../include/QtGui/private/../../../src/gui/kernel/qt_x11_p.h:280: error: ‘Colormap’ does not name a type
../../include/QtGui/private/../../../src/gui/kernel/qt_x11_p.h:281: error: ISO C++ forbids declaration of ‘Visual’ with no type
../../include/QtGui/private/../../../src/gui/kernel/qt_x11_p.h:281: error: expected ‘;’ before ‘*’ token
../../include/QtGui/private/../../../src/gui/kernel/qt_x11_p.h:290: error: ‘Time’ does not name a type
../../include/QtGui/private/../../../src/gui/kernel/qt_x11_p.h:291: error: ‘Window’ does not name a type
../../include/QtGui/private/../../../src/gui/kernel/qt_x11_p.h:292: error: ‘Window’ does not name a type
../../include/QtGui/private/../../../src/gui/kernel/qt_x11_p.h:315: error: ‘Window’ does not name a type
../../include/QtGui/private/../../../src/gui/kernel/qt_x11_p.h:318: error: ‘Window’ has not been declared
../../include/QtGui/private/../../../src/gui/kernel/qt_x11_p.h:319: error: ‘Window’ has not been declared
../../include/QtGui/private/../../../src/gui/kernel/qt_x11_p.h:319: error: ‘Atom’ has not been declared
../../include/QtGui/private/../../../src/gui/kernel/qt_x11_p.h:320: error: ‘Atom’ has not been declared
../../include/QtGui/private/../../../src/gui/kernel/qt_x11_p.h:321: error: ‘Window’ has not been declared
../../include/QtGui/private/../../../src/gui/kernel/qt_x11_p.h:321: error: ‘Atom’ has not been declared
../../include/QtGui/private/../../../src/gui/kernel/qt_x11_p.h:332: error: expected ‘,’ or ‘...’ before ‘*’ token
../../include/QtGui/private/../../../src/gui/kernel/qt_x11_p.h:332: error: ISO C++ forbids declaration of ‘XSelectionRequestEvent’ with no type
../../include/QtGui/private/../../../src/gui/kernel/qt_x11_p.h:334: error: ‘Atom’ has not been declared
../../include/QtGui/private/../../../src/gui/kernel/qt_x11_p.h:335: error: ‘Atom’ does not name a type
../../include/QtGui/private/../../../src/gui/kernel/qt_x11_p.h:337: error: ‘Atom’ has not been declared
../../include/QtGui/private/../../../src/gui/kernel/qt_x11_p.h:338: error: ‘Atom’ does not name a type
../../include/QtGui/private/../../../src/gui/kernel/qt_x11_p.h:339: error: ‘Atom’ has not been declared
../../include/QtGui/private/../../../src/gui/kernel/qt_x11_p.h:340: error: ‘Atom’ has not been declared
../../include/QtGui/private/../../../src/gui/kernel/qt_x11_p.h:340: error: ‘Atom’ has not been declared
../../include/QtGui/private/../../../src/gui/kernel/qt_x11_p.h:341: error: ‘Atom’ was not declared in this scope
../../include/QtGui/private/../../../src/gui/kernel/qt_x11_p.h:341: error: template argument 1 is invalid
../../include/QtGui/private/../../../src/gui/kernel/qt_x11_p.h:342: error: ‘Atom’ has not been declared
../../include/QtGui/private/../../../src/gui/kernel/qt_x11_p.h:343: error: ‘Atom’ does not name a type
../../include/QtGui/private/../../../src/gui/kernel/qt_x11_p.h:404: error: ISO C++ forbids declaration of ‘Atom’ with no type
../../include/QtGui/private/../../../src/gui/kernel/qt_x11_p.h:404: error: expected ‘;’ before ‘*’ token
../../include/QtGui/private/../../../src/gui/kernel/qt_x11_p.h:406: error: ISO C++ forbids declaration of ‘Window’ with no type
../../include/QtGui/private/../../../src/gui/kernel/qt_x11_p.h:406: error: expected ‘;’ before ‘*’ token
../../include/QtGui/private/../../../src/gui/kernel/qt_x11_p.h:408: error: ‘Window’ does not name a type
../../include/QtGui/private/../../../src/gui/kernel/qt_x11_p.h:414: error: ‘Time’ does not name a type
../../include/QtGui/private/../../../src/gui/kernel/qt_x11_p.h:415: error: ‘Time’ does not name a type
../../include/QtGui/private/../../../src/gui/kernel/qt_x11_p.h:441: error: ISO C++ forbids declaration of ‘Visual’ with no type
../../include/QtGui/private/../../../src/gui/kernel/qt_x11_p.h:441: error: expected ‘;’ before ‘*’ token
../../include/QtGui/private/../../../src/gui/kernel/qt_x11_p.h:442: error: ‘Colormap’ does not name a type
../../include/QtGui/private/../../../src/gui/kernel/qt_x11_p.h:620: error: ‘Atom’ does not name a type
../../include/QtGui/private/../../../src/gui/kernel/qt_x11_p.h:622: error: ‘Atom’ has not been declared
../../include/QtGui/private/../../../src/gui/kernel/qt_x11_p.h:645: error: ‘FocusOut’ was not declared in this scope
../../include/QtGui/private/../../../src/gui/kernel/qt_x11_p.h:646: error: ‘FocusIn’ was not declared in this scope
../../include/QtGui/private/../../../src/gui/kernel/qt_x11_p.h:647: error: ‘KeyPress’ was not declared in this scope
../../include/QtGui/private/../../../src/gui/kernel/qt_x11_p.h:648: error: ‘KeyRelease’ was not declared in this scope
../../include/QtGui/private/../../../src/gui/kernel/qt_x11_p.h:649: error: ‘None’ was not declared in this scope
../../include/QtGui/private/../../../src/gui/kernel/qt_x11_p.h:650: error: ‘RevertToParent’ was not declared in this scope
../../include/QtGui/private/../../../src/gui/kernel/qt_x11_p.h:651: error: ‘GrayScale’ was not declared in this scope
../../include/QtGui/private/../../../src/gui/kernel/qt_x11_p.h:652: error: ‘CursorShape’ was not declared in this scope
../../include/QtGui/private/../../../src/gui/kernel/qt_x11_p.h:667: error: ‘XPoint’ was not declared in this scope
../../include/QtGui/private/../../../src/gui/kernel/qt_x11_p.h:667: error: template argument 1 is invalid
../../include/QtGui/private/../../../src/gui/kernel/qt_x11_p.h:668: error: ‘XRectangle’ was not declared in this scope
../../include/QtGui/private/../../../src/gui/kernel/qt_x11_p.h:668: error: template argument 1 is invalid
../../include/QtGui/private/../../../src/gui/kernel/qt_x11_p.h:669: error: ‘XChar2b’ was not declared in this scope
../../include/QtGui/private/../../../src/gui/kernel/qt_x11_p.h:669: error: template argument 1 is invalid
make[1]: *** [.obj/release-shared/qapplication.o] Error 1
make[1]: Leaving directory `/tmp/qt-x11-opensource-src-4.4.3/src/gui'
make: *** [sub-gui-make_default-ordered] Error 2

随后停止。

请问这是什么问题? 如何解决? 请高手赐教。非常感谢!
上次由 norx 在 2009-03-04 9:55,总共编辑 1 次。
思辨 - 进取 - 乐观
tulanix
帖子: 47
注册时间: 2006-10-07 11:00
送出感谢: 0
接收感谢: 0

Re: 编译QT库时遇到ERROR,请高手赐教。

#2

帖子 tulanix » 2009-02-12 19:23

应该是缺少X11的开发库,好像是libx11-dev
头像
norx
帖子: 47
注册时间: 2008-10-30 3:20
送出感谢: 0
接收感谢: 0

Re: 编译QT库时遇到ERROR,请高手赐教。

#3

帖子 norx » 2009-02-27 0:25

思辨 - 进取 - 乐观
头像
evan_ma
帖子: 31
注册时间: 2009-04-20 11:50
送出感谢: 0
接收感谢: 0

Re: [已解决] 编译QT库时遇到ERROR,请高手赐教。

#4

帖子 evan_ma » 2009-04-20 18:44

我也遇到了这个问题~
libx11-dev哪里有下载呢?

我下载的是libx11_1.1.5.orig.tar.gz 是同一个东西吗?可以用么?
呜,笨猪~~
头像
gemy
帖子: 17
注册时间: 2005-12-13 13:51
系统: Mac Mavericks/Ubuntu
来自: 成都理工大学
送出感谢: 0
接收感谢: 0
联系:

Re: [已解决] 编译QT库时遇到ERROR,请高手赐教。

#5

帖子 gemy » 2009-04-23 21:46

你既然用的是ubuntu 这些系统库为何不直接 apt-get install libx11-dev呢.
互相宽容的朋友一定百年同舟;
互相宽容的夫妻一定百年共枕;
互相宽容的世界一定和平美丽。

有心能知,有情能爱,有缘能聚,有梦能圆。
http://wuqiong.info
http://www.diveinedu.com

Lenovo F41AT2390 /Ubuntu 13.04
2G Mem + 160G HDD +Nvidia 8400GS + Broadcom BCM4312 wireless card
bbkchishi
帖子: 39
注册时间: 2009-04-23 17:13
送出感谢: 0
接收感谢: 0

Re: [已解决] 编译QT库时遇到ERROR,请高手赐教。

#6

帖子 bbkchishi » 2009-05-07 10:16

这些错误都很简单吧, 你一看看不就明白了么?

从第一个错误开始, 少包含一个头文件,,后面自己看
回复

回到 “内核及嵌入式开发”